BDBM193410 US9670208, Example 272 4-(3-((6-methoxypyridin-3-yl)methyl)-[1,2,4]triazolo[4,3-a]pyridin-7-yl)-N-(tetrahydro-2H-pyran-4-yl)pyrimidin-2-amine
SMILES: COc1ccc(Cc2nnc3cc(ccn23)-c2ccnc(NC3CCOCC3)n2)cn1
InChI Key: InChIKey=JCROQVWNBXVPLM-UHFFFAOYSA-N
Data: 1 IC50
Activity Spreadsheet -- Enzyme Inhibition Constant Data from BindingDB
Found 1 hit for monomerid = 193410
Trg + Lig
Ki
nM
ΔG°
kcal/mole
IC50
nM
Kd
nM
EC50/IC50
nM
koff
s-1
kon
M-1s-1
pHTemp
°C
Mitogen-activated protein kinase 1 (aa 8-360)
(Homo sapiens (Human))
BDBM193410
(US9670208, Example 272 4-(3-((6-methoxypyridin-3-y...)
Show SMILES COc1ccc(Cc2nnc3cc(ccn23)-c2ccnc(NC3CCOCC3)n2)cn1
Show InChI InChI=1S/C22H23N7O2/c1-30-21-3-2-15(14-24-21)12-19-27-28-20-13-16(5-9-29(19)20)18-4-8-23-22(26-18)25-17-6-10-31-11-7-17/h2-5,8-9,13-14,17H,6-7,10-12H2,1H3,(H,23,25,26)
US Patent
n/an/a 0.900n/an/an/an/a7.3n/a
Array BioPharma Inc.; Genentech, Inc.
US Patent
Assay Description
Compounds were tested in an enzymatic assay using human ERK-2 (Mitogen Activated Kinase 1), recombinantly expressed as an n-terminal 6-His fusion pro...
US Patent US9670208 (2017)
BindingDB Entry DOI: 10.7270/Q2RJ4GMB