BDBM194283 US9199999, 21
SMILES: CC(C)CNc1nc(cn2c(cnc12)-c1ccc(cc1)C(=O)NC1CC1)C#CCCCC#N
InChI Key: InChIKey=NZRVNQXILCXBFD-UHFFFAOYSA-N
Data: 1 IC50
Activity Spreadsheet -- Enzyme Inhibition Constant Data from BindingDB
Found 1 hit for monomerid = 194283
Trg + Lig
Ki
nM
ΔG°
kcal/mole
IC50
nM
Kd
nM
EC50/IC50
nM
koff
s-1
kon
M-1s-1
pHTemp
°C
Dual specificity protein kinase TTK
(Homo sapiens (Human))
BDBM194283
(US9199999, 21)
Show SMILES CC(C)CNc1nc(cn2c(cnc12)-c1ccc(cc1)C(=O)NC1CC1)C#CCCCC#N
Show InChI InChI=1S/C26H28N6O/c1-18(2)15-28-24-25-29-16-23(32(25)17-22(30-24)7-5-3-4-6-14-27)19-8-10-20(11-9-19)26(33)31-21-12-13-21/h8-11,16-18,21H,3-4,6,12-13,15H2,1-2H3,(H,28,30)(H,31,33)
US Patent
n/an/a 1n/an/an/an/a7.722
Bayer Intellectual Property GmbH
US Patent
Assay Description
N-terminally GST-tagged human full length recombinant Mps-1 kinase (purchased from Invitrogen, Karslruhe, Germany, cat. no PV4071 ) was used. As subs...
US Patent US9199999 (2015)
BindingDB Entry DOI: 10.7270/Q2348J68