BDBM194435 US9200016, 117::US9902710, Compound 117
SMILES: COc1cc2c(C)ncc(Cc3cnc4cc(C)ccc4c3)c2cc1OC
InChI Key: InChIKey=NWBMXFYGRSIRLC-UHFFFAOYSA-N
Data: 2 IC50
Activity Spreadsheet -- Enzyme Inhibition Constant Data from BindingDB
Found 2 hits for monomerid = 194435
Trg + Lig
Ki
nM
ΔG°
kcal/mole
IC50
nM
Kd
nM
EC50/IC50
nM
koff
s-1
kon
M-1s-1
pHTemp
°C
cAMP and cAMP-inhibited cGMP 3',5'-cyclic phosphodiesterase 10A
(Homo sapiens (Human))
BDBM194435
(US9200016, 117 | US9902710, Compound 117)
Show SMILES COc1cc2c(C)ncc(Cc3cnc4cc(C)ccc4c3)c2cc1OC
Show InChI InChI=1S/C23H22N2O2/c1-14-5-6-17-8-16(12-25-21(17)7-14)9-18-13-24-15(2)19-10-22(26-3)23(27-4)11-20(18)19/h5-8,10-13H,9H2,1-4H3
Reactome pathway
US Patent
n/an/a 7.10n/an/an/an/an/an/a
University of Mississippi
Assay Description
The phosphodiesterase assay was developed using the LANCE® cAMP kit (PerkinElmer). The assay buffer contained HBSS with 5 mM HEPES, 0.1% BSA, and 1.5...
J Med Chem 48: 2906-15 (2005)
BindingDB Entry DOI: 10.7270/Q2PC34QT
cAMP and cAMP-inhibited cGMP 3',5'-cyclic phosphodiesterase 10A
(Homo sapiens (Human))
BDBM194435
(US9200016, 117 | US9902710, Compound 117)
Show SMILES COc1cc2c(C)ncc(Cc3cnc4cc(C)ccc4c3)c2cc1OC
Show InChI InChI=1S/C23H22N2O2/c1-14-5-6-17-8-16(12-25-21(17)7-14)9-18-13-24-15(2)19-10-22(26-3)23(27-4)11-20(18)19/h5-8,10-13H,9H2,1-4H3
Reactome pathway
US Patent
n/an/a 7.10n/an/an/an/a7.437
Allergan, Inc.; Exonhit Therapeutics, SA
US Patent
Assay Description
The phosphodiesterase assay was developed using the LANCE cAMP kit (PerkinElmer). The assay buffer contained HBSS with 5 mM HEPES, 0.1% BSA, and 1....
US Patent US9200016 (2015)
BindingDB Entry DOI: 10.7270/Q2ZC81PH