null
SMILES: C(Nc1ccccc1)c1ccc(CNc2ccccc2)cc1
InChI Key: InChIKey=DXWQPWMYKQYRDS-UHFFFAOYSA-N
Activity Spreadsheet -- Enzyme Inhibition Constant Data from BindingDB
Found 1 hit for monomerid = 194513
Trg + Lig
Ki
nM
ΔG°
kcal/mole
IC50
nM
Kd
nM
EC50/IC50
nM
koff
s-1
kon
M-1s-1
pHTemp
°C
C-X-C chemokine receptor type 4
(Rattus norvegicus (Rat))
BDBM194513
(US9205085, MSX- 135)
Show SMILES C(Nc1ccccc1)c1ccc(CNc2ccccc2)cc1
Show InChI InChI=1S/C20H20N2/c1-3-7-19(8-4-1)21-15-17-11-13-18(14-12-17)16-22-20-9-5-2-6-10-20/h1-14,21-22H,15-16H2
US Patent
n/an/a<10n/an/an/an/an/an/a
Emory University
US Patent
Assay Description
A synthetic 14-mer peptide, TN14003, was previously reported to block both SDF-1/CXCR4 mediated invasion in vitro and metastasis in vivo with a high ...
US Patent US9205085 (2015)
BindingDB Entry DOI: 10.7270/Q2FF3R5M