BDBM194517 US9205085, MSX- 173
SMILES: Cc1cc(CNc2ccccc2)c(C)cc1CNc1ccccc1
InChI Key: InChIKey=YHISBKKOGGHIDE-UHFFFAOYSA-N
Data: 1 IC50
Activity Spreadsheet -- Enzyme Inhibition Constant Data from BindingDB
Found 1 hit for monomerid = 194517
Trg + Lig
Ki
nM
ΔG°
kcal/mole
IC50
nM
Kd
nM
EC50/IC50
nM
koff
s-1
kon
M-1s-1
pHTemp
°C
C-X-C chemokine receptor type 4 (CXCR4/SDF-1)
(Rattus norvegicus (Rat))
BDBM194517
(US9205085, MSX- 173)
Show SMILES Cc1cc(CNc2ccccc2)c(C)cc1CNc1ccccc1
Show InChI InChI=1S/C22H24N2/c1-17-13-20(16-24-22-11-7-4-8-12-22)18(2)14-19(17)15-23-21-9-5-3-6-10-21/h3-14,23-24H,15-16H2,1-2H3
US Patent
n/an/a>100n/an/an/an/an/an/a
Emory University
US Patent
Assay Description
A synthetic 14-mer peptide, TN14003, was previously reported to block both SDF-1/CXCR4 mediated invasion in vitro and metastasis in vivo with a high ...
US Patent US9205085 (2015)
BindingDB Entry DOI: 10.7270/Q2FF3R5M