BDBM194546 US9205085, MSX- 175
SMILES: C(Nc1ccccc1)c1ccc(CNc2ccccc2)c2ccccc12
InChI Key: InChIKey=BOYIDLLYXRSLBV-UHFFFAOYSA-N
Data: 1 IC50
Activity Spreadsheet -- Enzyme Inhibition Constant Data from BindingDB
Found 1 hit for monomerid = 194546
Trg + Lig
Ki
nM
ΔG°
kcal/mole
IC50
nM
Kd
nM
EC50/IC50
nM
koff
s-1
kon
M-1s-1
pHTemp
°C
C-X-C chemokine receptor type 4 (CXCR4/SDF-1)
(Rattus norvegicus (Rat))
BDBM194546
(US9205085, MSX- 175)
Show SMILES C(Nc1ccccc1)c1ccc(CNc2ccccc2)c2ccccc12
Show InChI InChI=1S/C24H22N2/c1-3-9-21(10-4-1)25-17-19-15-16-20(24-14-8-7-13-23(19)24)18-26-22-11-5-2-6-12-22/h1-16,25-26H,17-18H2
US Patent
n/an/a>100n/an/an/an/an/an/a
Emory University
US Patent
Assay Description
A synthetic 14-mer peptide, TN14003, was previously reported to block both SDF-1/CXCR4 mediated invasion in vitro and metastasis in vivo with a high ...
US Patent US9205085 (2015)
BindingDB Entry DOI: 10.7270/Q2FF3R5M