BDBM194589 US9206129, 5
SMILES: Nc1c(cc(c2ccccc12)S(=O)(=O)O[Na])\N=N\c1ccc(nc1)-c1ccccc1-c1ccccc1
InChI Key: InChIKey=YQOZWQYCNPBZGJ-FJISBNMDSA-M
Data: 1 IC50
Activity Spreadsheet -- Enzyme Inhibition Constant Data from BindingDB
Found 1 hit for monomerid = 194589
Trg + Lig
Ki
nM
ΔG°
kcal/mole
IC50
nM
Kd
nM
EC50/IC50
nM
koff
s-1
kon
M-1s-1
pHTemp
°C
Valosin-containing protein (VCP)
(Mus musculus (Mouse))
BDBM194589
(US9206129, 5)
Show SMILES Nc1c(cc(c2ccccc12)S(=O)(=O)O[Na])\N=N\c1ccc(nc1)-c1ccccc1-c1ccccc1
Show InChI InChI=1S/C27H20N4O3S.Na/c28-27-23-13-7-6-12-22(23)26(35(32,33)34)16-25(27)31-30-19-14-15-24(29-17-19)21-11-5-4-10-20(21)18-8-2-1-3-9-18;/h1-17H,28H2,(H,32,33,34);/q;+1/p-1/b31-30+;
US Patent
n/an/a 116n/an/an/an/a8.037
Daito Chemix Corporation; Kyoto University
US Patent
Assay Description
Mouse VCP cDNA was added with a DNA sequence corresponding to histidine tag at the amino-terminal, subcloned into a baculovirus vector pVL1392 (BD Bi...
US Patent US9206129 (2015)
BindingDB Entry DOI: 10.7270/Q29P30GQ