BDBM194592 US9206129, 8
SMILES: CC(=O)c1ccc(cc1)-c1ccc(cn1)\N=N\c1cc(c2ccccc2c1N)S(=O)(=O)O[Na]
InChI Key: InChIKey=PCPNEMDKGCMAJZ-JGUILPGDSA-M
Data: 1 IC50
Activity Spreadsheet -- Enzyme Inhibition Constant Data from BindingDB
Found 1 hit for monomerid = 194592
Trg + Lig
Ki
nM
ΔG°
kcal/mole
IC50
nM
Kd
nM
EC50/IC50
nM
koff
s-1
kon
M-1s-1
pHTemp
°C
Valosin-containing protein (VCP)
(Mus musculus (Mouse))
BDBM194592
(US9206129, 8)
Show SMILES CC(=O)c1ccc(cc1)-c1ccc(cn1)\N=N\c1cc(c2ccccc2c1N)S(=O)(=O)O[Na]
Show InChI InChI=1S/C23H18N4O4S.Na/c1-14(28)15-6-8-16(9-7-15)20-11-10-17(13-25-20)26-27-21-12-22(32(29,30)31)18-4-2-3-5-19(18)23(21)24;/h2-13H,24H2,1H3,(H,29,30,31);/q;+1/p-1/b27-26+;
US Patent
n/an/a 136n/an/an/an/a8.037
Daito Chemix Corporation; Kyoto University
US Patent
Assay Description
Mouse VCP cDNA was added with a DNA sequence corresponding to histidine tag at the amino-terminal, subcloned into a baculovirus vector pVL1392 (BD Bi...
US Patent US9206129 (2015)
BindingDB Entry DOI: 10.7270/Q29P30GQ