BDBM194784 US9206167, 5::USRE48059, Compound of Example 5
SMILES: Cc1cc2ccc(OCCCN3CCN(CC3)c3cccc4sccc34)cc2[nH]c1=O
InChI Key: InChIKey=NHZKQPUHNXXGKW-UHFFFAOYSA-N
Data: 4 KI
Activity Spreadsheet -- Enzyme Inhibition Constant Data from BindingDB
Found 4 hits for monomerid = 194784
Trg + Lig
Ki
nM
ΔG°
kcal/mole
IC50
nM
Kd
nM
EC50/IC50
nM
koff
s-1
kon
M-1s-1
pHTemp
°C
D(2) dopamine receptor
(Rattus norvegicus (rat))
BDBM194784
(US9206167, 5 | USRE48059, Compound of Example 5)
Show SMILES Cc1cc2ccc(OCCCN3CCN(CC3)c3cccc4sccc34)cc2[nH]c1=O
Show InChI InChI=1S/C25H27N3O2S/c1-18-16-19-6-7-20(17-22(19)26-25(18)29)30-14-3-9-27-10-12-28(13-11-27)23-4-2-5-24-21(23)8-15-31-24/h2,4-8,15-17H,3,9-14H2,1H3,(H,26,29)
Reactome pathway
US Patent
0.600n/an/an/an/an/an/an/an/a
Otsuka Pharmaceutical Co., Ltd.
US Patent
Assay Description
Dopamine D2: The binding assay was performed using 40 μl of the membrane specimen, 20 μl of [3H]-raclopride (final concentration 1 to 2 nM)...
US Patent USRE48059 (2020)
D(2) dopamine receptor
(Rattus norvegicus (rat))
BDBM194784
(US9206167, 5 | USRE48059, Compound of Example 5)
Show SMILES Cc1cc2ccc(OCCCN3CCN(CC3)c3cccc4sccc34)cc2[nH]c1=O
Show InChI InChI=1S/C25H27N3O2S/c1-18-16-19-6-7-20(17-22(19)26-25(18)29)30-14-3-9-27-10-12-28(13-11-27)23-4-2-5-24-21(23)8-15-31-24/h2,4-8,15-17H,3,9-14H2,1H3,(H,26,29)
Reactome pathway
US Patent
0.600 -12.6n/an/an/an/an/a7.425
OTSUKA PHARMACEUTICAL CO., LTD.
US Patent
Assay Description
The assay was performed according to the method by Kohler et al. (Kohler C, Hall H, Ogren S O and Gawell L, Specific in vitro and in vivo binding of ...
US Patent US9206167 (2015)
BindingDB Entry DOI: 10.7270/Q2XD10GS
5-hydroxytryptamine receptor 2A
(Rattus norvegicus (rat))
BDBM194784
(US9206167, 5 | USRE48059, Compound of Example 5)
Show SMILES Cc1cc2ccc(OCCCN3CCN(CC3)c3cccc4sccc34)cc2[nH]c1=O
Show InChI InChI=1S/C25H27N3O2S/c1-18-16-19-6-7-20(17-22(19)26-25(18)29)30-14-3-9-27-10-12-28(13-11-27)23-4-2-5-24-21(23)8-15-31-24/h2,4-8,15-17H,3,9-14H2,1H3,(H,26,29)
Reactome pathway
US Patent
6.40n/an/an/an/an/an/an/an/a
Otsuka Pharmaceutical Co., Ltd.
US Patent
Assay Description
5-HT2A: The binding assay was performed using 40 μl of the membrane specimen, 20 μl of [3H]-Ketanserin (final concentration 1 to 3 nM), 20 ...
US Patent USRE48059 (2020)
5-hydroxytryptamine receptor 2A
(Rattus norvegicus (rat))
BDBM194784
(US9206167, 5 | USRE48059, Compound of Example 5)
Show SMILES Cc1cc2ccc(OCCCN3CCN(CC3)c3cccc4sccc34)cc2[nH]c1=O
Show InChI InChI=1S/C25H27N3O2S/c1-18-16-19-6-7-20(17-22(19)26-25(18)29)30-14-3-9-27-10-12-28(13-11-27)23-4-2-5-24-21(23)8-15-31-24/h2,4-8,15-17H,3,9-14H2,1H3,(H,26,29)
Reactome pathway
US Patent
6.40 -11.6n/an/an/an/an/a7.437
OTSUKA PHARMACEUTICAL CO., LTD.
US Patent
Assay Description
The assay was performed according to the method by Leysen J E et al. (Leysen J E, Niemegeers C J E, Van Nueten J M and Laduron P M. [3H] Ketanserin (...
US Patent US9206167 (2015)
BindingDB Entry DOI: 10.7270/Q2XD10GS