BDBM194811 US9206167, 33::USRE48059, Compound of Example 33
SMILES: O=C1NCCc2ccc(OCCCCN3CCN(CC3)c3cccc4sccc34)cc12
InChI Key: InChIKey=JJQVVHYUPXCLCP-UHFFFAOYSA-N
Data: 4 KI
Activity Spreadsheet -- Enzyme Inhibition Constant Data from BindingDB
Found 4 hits for monomerid = 194811
Trg + Lig
Ki
nM
ΔG°
kcal/mole
IC50
nM
Kd
nM
EC50/IC50
nM
koff
s-1
kon
M-1s-1
pHTemp
°C
D(2) dopamine receptor
(Rattus norvegicus (rat))
BDBM194811
(US9206167, 33 | USRE48059, Compound of Example 33)
Show SMILES O=C1NCCc2ccc(OCCCCN3CCN(CC3)c3cccc4sccc34)cc12
Show InChI InChI=1S/C25H29N3O2S/c29-25-22-18-20(7-6-19(22)8-10-26-25)30-16-2-1-11-27-12-14-28(15-13-27)23-4-3-5-24-21(23)9-17-31-24/h3-7,9,17-18H,1-2,8,10-16H2,(H,26,29)
Reactome pathway
US Patent
1.10n/an/an/an/an/an/an/an/a
Otsuka Pharmaceutical Co., Ltd.
US Patent
Assay Description
Dopamine D2: The binding assay was performed using 40 μl of the membrane specimen, 20 μl of [3H]-raclopride (final concentration 1 to 2 nM)...
US Patent USRE48059 (2020)
D(2) dopamine receptor
(Rattus norvegicus (rat))
BDBM194811
(US9206167, 33 | USRE48059, Compound of Example 33)
Show SMILES O=C1NCCc2ccc(OCCCCN3CCN(CC3)c3cccc4sccc34)cc12
Show InChI InChI=1S/C25H29N3O2S/c29-25-22-18-20(7-6-19(22)8-10-26-25)30-16-2-1-11-27-12-14-28(15-13-27)23-4-3-5-24-21(23)9-17-31-24/h3-7,9,17-18H,1-2,8,10-16H2,(H,26,29)
Reactome pathway
US Patent
1.10 -12.2n/an/an/an/an/a7.425
OTSUKA PHARMACEUTICAL CO., LTD.
US Patent
Assay Description
The assay was performed according to the method by Kohler et al. (Kohler C, Hall H, Ogren S O and Gawell L, Specific in vitro and in vivo binding of ...
US Patent US9206167 (2015)
BindingDB Entry DOI: 10.7270/Q2XD10GS
5-hydroxytryptamine receptor 2A
(Rattus norvegicus (rat))
BDBM194811
(US9206167, 33 | USRE48059, Compound of Example 33)
Show SMILES O=C1NCCc2ccc(OCCCCN3CCN(CC3)c3cccc4sccc34)cc12
Show InChI InChI=1S/C25H29N3O2S/c29-25-22-18-20(7-6-19(22)8-10-26-25)30-16-2-1-11-27-12-14-28(15-13-27)23-4-3-5-24-21(23)9-17-31-24/h3-7,9,17-18H,1-2,8,10-16H2,(H,26,29)
Reactome pathway
US Patent
6.60n/an/an/an/an/an/an/an/a
Otsuka Pharmaceutical Co., Ltd.
US Patent
Assay Description
5-HT2A: The binding assay was performed using 40 μl of the membrane specimen, 20 μl of [3H]-Ketanserin (final concentration 1 to 3 nM), 20 ...
US Patent USRE48059 (2020)
5-hydroxytryptamine receptor 2A
(Rattus norvegicus (rat))
BDBM194811
(US9206167, 33 | USRE48059, Compound of Example 33)
Show SMILES O=C1NCCc2ccc(OCCCCN3CCN(CC3)c3cccc4sccc34)cc12
Show InChI InChI=1S/C25H29N3O2S/c29-25-22-18-20(7-6-19(22)8-10-26-25)30-16-2-1-11-27-12-14-28(15-13-27)23-4-3-5-24-21(23)9-17-31-24/h3-7,9,17-18H,1-2,8,10-16H2,(H,26,29)
Reactome pathway
US Patent
6.60 -11.6n/an/an/an/an/a7.437
OTSUKA PHARMACEUTICAL CO., LTD.
US Patent
Assay Description
The assay was performed according to the method by Leysen J E et al. (Leysen J E, Niemegeers C J E, Van Nueten J M and Laduron P M. [3H] Ketanserin (...
US Patent US9206167 (2015)
BindingDB Entry DOI: 10.7270/Q2XD10GS