BDBM194899 US9206184, 80
SMILES: COc1cc(C)cc2cc(sc12)-c1c(CN2CCNC(=O)C2)c(Cl)n2ncnc(N)c12
InChI Key: InChIKey=KXKRDLMFFZNYPD-UHFFFAOYSA-N
Data: 2 IC50
Activity Spreadsheet -- Enzyme Inhibition Constant Data from BindingDB
Found 2 hits for monomerid = 194899
Trg + Lig
Ki
nM
ΔG°
kcal/mole
IC50
nM
Kd
nM
EC50/IC50
nM
koff
s-1
kon
M-1s-1
pHTemp
°C
Fibroblast growth factor receptor 3
(Homo sapiens (Human))
BDBM194899
(US9206184, 80)
Show SMILES COc1cc(C)cc2cc(sc12)-c1c(CN2CCNC(=O)C2)c(Cl)n2ncnc(N)c12
Show InChI InChI=1S/C21H21ClN6O2S/c1-11-5-12-7-15(31-19(12)14(6-11)30-2)17-13(8-27-4-3-24-16(29)9-27)20(22)28-18(17)21(23)25-10-26-28/h5-7,10H,3-4,8-9H2,1-2H3,(H,24,29)(H2,23,25,26)
Reactome pathway
US Patent
n/an/a 0.200n/an/an/an/a7.022
BAYER INTELLECTUAL PROPERTY GmbH
US Patent
Assay Description
For the assay, 50 nl of each stock solution of the test compound in DMSO was pipetted into a black, low-volume 384-well microtiter plate (Greiner Bio...
US Patent US9206184 (2015)
BindingDB Entry DOI: 10.7270/Q2SN07SH
Fibroblast growth factor receptor 1
(Homo sapiens (Human))
BDBM194899
(US9206184, 80)
Show SMILES COc1cc(C)cc2cc(sc12)-c1c(CN2CCNC(=O)C2)c(Cl)n2ncnc(N)c12
Show InChI InChI=1S/C21H21ClN6O2S/c1-11-5-12-7-15(31-19(12)14(6-11)30-2)17-13(8-27-4-3-24-16(29)9-27)20(22)28-18(17)21(23)25-10-26-28/h5-7,10H,3-4,8-9H2,1-2H3,(H,24,29)(H2,23,25,26)
NCI pathway
Reactome pathway
US Patent
n/an/a 1.30n/an/an/an/a7.022
BAYER INTELLECTUAL PROPERTY GmbH
US Patent
Assay Description
For the assay, 50 nl of each stock solution of the test compound in DMSO was pipetted into a black, low-volume 384-well microtiter plate (Greiner Bio...
US Patent US9206184 (2015)
BindingDB Entry DOI: 10.7270/Q2SN07SH