BDBM19510 (2R)-3-[(4-bromobenzene)sulfonyl]-N-(1-cyanocyclopropyl)-2-{[(1S)-2,2,2-trifluoro-1-phenylethyl]amino}propanamide::trifluoroethylamine inhibitor, 20
SMILES: FC(F)(F)[C@@H](N[C@@H](CS(=O)(=O)c1ccc(Br)cc1)C(=O)NC1(CC1)C#N)c1ccccc1
InChI Key: InChIKey=GLDNCRGNTMYXND-ROUUACIJSA-N
Data: 4 IC50
Activity Spreadsheet -- Enzyme Inhibition Constant Data from BindingDB
Found 4 hits for monomerid = 19510
Trg + Lig
Ki
nM
ΔG°
kcal/mole
IC50
nM
Kd
nM
EC50/IC50
nM
koff
s-1
kon
M-1s-1
pHTemp
°C
Cathepsin S
(Homo sapiens (Human))
BDBM19510
((2R)-3-[(4-bromobenzene)sulfonyl]-N-(1-cyanocyclop...)
Show SMILES FC(F)(F)[C@@H](N[C@@H](CS(=O)(=O)c1ccc(Br)cc1)C(=O)NC1(CC1)C#N)c1ccccc1 |r|
Show InChI InChI=1S/C21H19BrF3N3O3S/c22-15-6-8-16(9-7-15)32(30,31)12-17(19(29)28-20(13-26)10-11-20)27-18(21(23,24)25)14-4-2-1-3-5-14/h1-9,17-18,27H,10-12H2,(H,28,29)/t17-,18-/m0/s1
Reactome pathway
n/an/a 0.300n/an/an/an/a6.522
Merck Frosst Centre for Therapeutic Research
Assay Description
Prior to the addition of substrate, different concentrations of the inhibitor ranging from 100 uM to 0.2 nM were preincubated for 15 min with enzyme ...
Bioorg Med Chem Lett 17: 4929-33 (2007)
Article DOI: 10.1016/j.bmcl.2007.06.023
BindingDB Entry DOI: 10.7270/Q26W98C3
Procathepsin L
(Homo sapiens (Human))
BDBM19510
((2R)-3-[(4-bromobenzene)sulfonyl]-N-(1-cyanocyclop...)
Show SMILES FC(F)(F)[C@@H](N[C@@H](CS(=O)(=O)c1ccc(Br)cc1)C(=O)NC1(CC1)C#N)c1ccccc1 |r|
Show InChI InChI=1S/C21H19BrF3N3O3S/c22-15-6-8-16(9-7-15)32(30,31)12-17(19(29)28-20(13-26)10-11-20)27-18(21(23,24)25)14-4-2-1-3-5-14/h1-9,17-18,27H,10-12H2,(H,28,29)/t17-,18-/m0/s1
Reactome pathway
n/an/a 15n/an/an/an/an/an/a
Merck Frosst Centre for Therapeutic Research
Assay Description
Prior to the addition of substrate, different concentrations of the inhibitor ranging from 100 uM to 0.2 nM were preincubated for 15 min with enzyme ...
Bioorg Med Chem Lett 17: 4929-33 (2007)
Article DOI: 10.1016/j.bmcl.2007.06.023
BindingDB Entry DOI: 10.7270/Q26W98C3
Cathepsin K
(Oryctolagus cuniculus (rabbit))
BDBM19510
((2R)-3-[(4-bromobenzene)sulfonyl]-N-(1-cyanocyclop...)
Show SMILES FC(F)(F)[C@@H](N[C@@H](CS(=O)(=O)c1ccc(Br)cc1)C(=O)NC1(CC1)C#N)c1ccccc1 |r|
Show InChI InChI=1S/C21H19BrF3N3O3S/c22-15-6-8-16(9-7-15)32(30,31)12-17(19(29)28-20(13-26)10-11-20)27-18(21(23,24)25)14-4-2-1-3-5-14/h1-9,17-18,27H,10-12H2,(H,28,29)/t17-,18-/m0/s1
n/an/a 290n/an/an/an/an/an/a
Merck Frosst Centre for Therapeutic Research
Assay Description
Prior to the addition of substrate, different concentrations of the inhibitor ranging from 100 uM to 0.2 nM were preincubated for 15 min with enzyme ...
Bioorg Med Chem Lett 17: 4929-33 (2007)
Article DOI: 10.1016/j.bmcl.2007.06.023
BindingDB Entry DOI: 10.7270/Q26W98C3
Cathepsin B
(Homo sapiens (Human))
BDBM19510
((2R)-3-[(4-bromobenzene)sulfonyl]-N-(1-cyanocyclop...)
Show SMILES FC(F)(F)[C@@H](N[C@@H](CS(=O)(=O)c1ccc(Br)cc1)C(=O)NC1(CC1)C#N)c1ccccc1 |r|
Show InChI InChI=1S/C21H19BrF3N3O3S/c22-15-6-8-16(9-7-15)32(30,31)12-17(19(29)28-20(13-26)10-11-20)27-18(21(23,24)25)14-4-2-1-3-5-14/h1-9,17-18,27H,10-12H2,(H,28,29)/t17-,18-/m0/s1
Reactome pathway
n/an/a 3.45E+3n/an/an/an/an/an/a
Merck Frosst Centre for Therapeutic Research
Assay Description
Prior to the addition of substrate, different concentrations of the inhibitor ranging from 100 uM to 0.2 nM were preincubated for 15 min with enzyme ...
Bioorg Med Chem Lett 17: 4929-33 (2007)
Article DOI: 10.1016/j.bmcl.2007.06.023
BindingDB Entry DOI: 10.7270/Q26W98C3