BDBM195379 US10336717, Compound 463::US9212153, 463,Ex. 397
SMILES: CN1C(N)=NC2(C1=O)c1cc(ccc1CC21CCc2noc(C)c2C1)-c1cc(F)cc(Cl)c1
InChI Key: InChIKey=DNOOGMCBXHNTTH-UHFFFAOYSA-N
Data: 2 IC50
Activity Spreadsheet -- Enzyme Inhibition Constant Data from BindingDB
Found 2 hits for monomerid = 195379
Trg + Lig
Ki
nM
ΔG°
kcal/mole
IC50
nM
Kd
nM
EC50/IC50
nM
koff
s-1
kon
M-1s-1
pHTemp
°C
Beta-secretase 1
(Homo sapiens (Human))
BDBM195379
(US10336717, Compound 463 | US9212153, 463,Ex. 397)
Show SMILES CN1C(N)=NC2(C1=O)c1cc(ccc1CC21CCc2noc(C)c2C1)-c1cc(F)cc(Cl)c1 |c:3|
Show InChI InChI=1S/C25H22ClFN4O2/c1-13-19-12-24(6-5-21(19)30-33-13)11-15-4-3-14(16-7-17(26)10-18(27)8-16)9-20(15)25(24)22(32)31(2)23(28)29-25/h3-4,7-10H,5-6,11-12H2,1-2H3,(H2,28,29)
PCBioAssay
n/an/a 1.10n/an/an/an/an/an/a
SRMLSC
Curated by PubChem BioAssay
Assay Description
For each compound being tested, the BACE activity was monitored in a fluorescence quenching assay (FRET) using the ectodomain of BACE (aa 1-454) fuse...
PubChem Bioassay (2007)
BindingDB Entry DOI: 10.7270/Q2WH2NCD
Beta-secretase 1 (aa 1-458)
(Homo sapiens (Human))
BDBM195379
(US10336717, Compound 463 | US9212153, 463,Ex. 397)
Show SMILES CN1C(N)=NC2(C1=O)c1cc(ccc1CC21CCc2noc(C)c2C1)-c1cc(F)cc(Cl)c1 |c:3|
Show InChI InChI=1S/C25H22ClFN4O2/c1-13-19-12-24(6-5-21(19)30-33-13)11-15-4-3-14(16-7-17(26)10-18(27)8-16)9-20(15)25(24)22(32)31(2)23(28)29-25/h3-4,7-10H,5-6,11-12H2,1-2H3,(H2,28,29)
US Patent
n/an/a 1.10n/an/an/an/a4.525
Vitae Pharmaceuticals, Inc.; Boehringer Ingelheim International GmbH
US Patent
Assay Description
Inhibitory activity of compounds was assessed by a fluorescence quench assay of BACE activity using commercially available substrate HiLyte Fluor 488...
US Patent US9212153 (2015)
BindingDB Entry DOI: 10.7270/Q2J67FRJ