BDBM195403 US10336717, Compound 522::US9212153, 523,Ex. 420
SMILES: CN1C(N)=N[C@@]2(C1=O)c1cc(ccc1C[C@@]21CC[C@@H](CC1)OC(F)F)C#CC1CC1
InChI Key: InChIKey=ALRNPPMJSNVXIC-NLSFWIRASA-N
Data: 2 IC50
Activity Spreadsheet -- Enzyme Inhibition Constant Data from BindingDB
Found 2 hits for monomerid = 195403
Trg + Lig
Ki
nM
ΔG°
kcal/mole
IC50
nM
Kd
nM
EC50/IC50
nM
koff
s-1
kon
M-1s-1
pHTemp
°C
Beta-secretase 1
(Homo sapiens (Human))
BDBM195403
(US10336717, Compound 522 | US9212153, 523,Ex. 420)
Show SMILES CN1C(N)=N[C@@]2(C1=O)c1cc(ccc1C[C@@]21CC[C@@H](CC1)OC(F)F)C#CC1CC1 |r,wD:15.16,5.4,18.24,c:3,(2.1,4.25,;1.33,2.92,;-.21,2.92,;-.98,4.25,;-.68,1.45,;.56,.55,;1.81,1.45,;3.14,2.22,;-.9,.07,;-2.24,.84,;-3.57,.07,;-3.57,-1.47,;-2.24,-2.24,;-.9,-1.47,;.56,-1.94,;1.47,-.7,;2.24,.63,;3.78,.63,;4.55,-.7,;3.78,-2.03,;2.24,-2.03,;6.05,-.7,;6.82,-2.03,;6.05,-3.37,;8.36,-2.03,;-4.9,.84,;-6.24,1.61,;-7.57,2.38,;-8.34,3.71,;-9.11,2.38,)|
Show InChI InChI=1S/C23H25F2N3O2/c1-28-19(29)23(27-21(28)26)18-12-15(5-4-14-2-3-14)6-7-16(18)13-22(23)10-8-17(9-11-22)30-20(24)25/h6-7,12,14,17,20H,2-3,8-11,13H2,1H3,(H2,26,27)/t17-,22-,23-/m1/s1
PCBioAssay
n/an/a 294n/an/an/an/an/an/a
SRMLSC
Curated by PubChem BioAssay
Assay Description
For each compound being tested, the BACE activity was monitored in a fluorescence quenching assay (FRET) using the ectodomain of BACE (aa 1-454) fuse...
PubChem Bioassay (2007)
BindingDB Entry DOI: 10.7270/Q2WH2NCD
Beta-secretase 1 (aa 1-458)
(Homo sapiens (Human))
BDBM195403
(US10336717, Compound 522 | US9212153, 523,Ex. 420)
Show SMILES CN1C(N)=N[C@@]2(C1=O)c1cc(ccc1C[C@@]21CC[C@@H](CC1)OC(F)F)C#CC1CC1 |r,wD:15.16,5.4,18.24,c:3,(2.1,4.25,;1.33,2.92,;-.21,2.92,;-.98,4.25,;-.68,1.45,;.56,.55,;1.81,1.45,;3.14,2.22,;-.9,.07,;-2.24,.84,;-3.57,.07,;-3.57,-1.47,;-2.24,-2.24,;-.9,-1.47,;.56,-1.94,;1.47,-.7,;2.24,.63,;3.78,.63,;4.55,-.7,;3.78,-2.03,;2.24,-2.03,;6.05,-.7,;6.82,-2.03,;6.05,-3.37,;8.36,-2.03,;-4.9,.84,;-6.24,1.61,;-7.57,2.38,;-8.34,3.71,;-9.11,2.38,)|
Show InChI InChI=1S/C23H25F2N3O2/c1-28-19(29)23(27-21(28)26)18-12-15(5-4-14-2-3-14)6-7-16(18)13-22(23)10-8-17(9-11-22)30-20(24)25/h6-7,12,14,17,20H,2-3,8-11,13H2,1H3,(H2,26,27)/t17-,22-,23-/m1/s1
US Patent
n/an/a 2.40n/an/an/an/a4.4n/a
Vitae Pharmaceuticals, Inc.; Boehringer Ingelheim International GmbH
US Patent
Assay Description
For each compound being tested, the BACE activity was monitored in a fluorescence quenching assay (FRET) using the ectodomain of BACE (aa 1-454) fuse...
US Patent US9212153 (2015)
BindingDB Entry DOI: 10.7270/Q2J67FRJ