BDBM195421 US9212153, 4
SMILES:
InChI Key: InChIKey=NNDRHDSCYLMORV-UHFFFAOYSA-N
Data: 1 IC50
Activity Spreadsheet -- Enzyme Inhibition Constant Data from BindingDB
Found 1 hit for monomerid = 195421
Trg + Lig
Ki
nM
ΔG°
kcal/mole
IC50
nM
Kd
nM
EC50/IC50
nM
koff
s-1
kon
M-1s-1
pHTemp
°C
Beta-secretase 1 (aa 1-458)
(Homo sapiens (Human))
BDBM195421
(US9212153, 4)
Show InChI InChI=1S/C26H27N3O2/c1-29-23(28)15-26(24(29)30)22-13-19(18-5-3-4-17(12-18)16-27)6-7-20(22)14-25(26)10-8-21(31-2)9-11-25/h3-7,12-13,15,21H,8-11,14,28H2,1-2H3
US Patent
n/an/a 4n/an/an/an/a4.525
Vitae Pharmaceuticals, Inc.; Boehringer Ingelheim International GmbH
US Patent
Assay Description
Inhibitory activity of compounds was assessed by a fluorescence quench assay of BACE activity using commercially available substrate HiLyte Fluor 488...
US Patent US9212153 (2015)
BindingDB Entry DOI: 10.7270/Q2J67FRJ