BDBM195522 US9212153, 335,Ex. 282
SMILES: COC1CCC2(Cc3ccc(cc3[C@]22N=C(N)N(C[C@H]3CCCO3)C2=O)C#CC2CC2)CC1
InChI Key: InChIKey=BHUFUPBWYHSWOM-UZLQEEKBSA-N
Data: 1 IC50
Activity Spreadsheet -- Enzyme Inhibition Constant Data from BindingDB
Found 1 hit for monomerid = 195522
Trg + Lig
Ki
nM
ΔG°
kcal/mole
IC50
nM
Kd
nM
EC50/IC50
nM
koff
s-1
kon
M-1s-1
pHTemp
°C
Beta-secretase 1 (aa 1-458)
(Homo sapiens (Human))
BDBM195522
(US9212153, 335,Ex. 282)
Show SMILES COC1CCC2(Cc3ccc(cc3[C@]22N=C(N)N(C[C@H]3CCCO3)C2=O)C#CC2CC2)CC1 |r,wD:13.15,19.20,t:16,(5.04,19.3,;3.5,19.3,;2.73,20.63,;1.4,19.86,;.3,21,;-1.19,21.32,;-2.1,20.07,;-3.56,20.55,;-4.9,19.78,;-6.23,20.55,;-6.23,22.09,;-4.9,22.86,;-3.56,22.09,;-2.1,22.56,;-3,23.81,;-2.1,25.05,;-2.5,26.54,;-.63,24.58,;.7,25.35,;2.03,24.58,;2.03,23.04,;3.5,22.56,;4.4,23.81,;3.5,25.05,;-.63,23.04,;.85,22.42,;-7.56,22.86,;-8.9,23.63,;-10.23,24.4,;-11.77,24.4,;-11,25.73,;.14,22.09,;1.24,21,)|
Show InChI InChI=1S/C27H33N3O3/c1-32-21-10-12-26(13-11-21)16-20-9-8-19(7-6-18-4-5-18)15-23(20)27(26)24(31)30(25(28)29-27)17-22-3-2-14-33-22/h8-9,15,18,21-22H,2-5,10-14,16-17H2,1H3,(H2,28,29)/t21?,22-,26?,27-/m1/s1
US Patent
n/an/a 2.20n/an/an/an/a4.4n/a
Vitae Pharmaceuticals, Inc.; Boehringer Ingelheim International GmbH
US Patent
Assay Description
For each compound being tested, the BACE activity was monitored in a fluorescence quenching assay (FRET) using the ectodomain of BACE (aa 1-454) fuse...
US Patent US9212153 (2015)
BindingDB Entry DOI: 10.7270/Q2J67FRJ