BDBM19567 (2S)-N-{2-[(4-methoxyphenyl)amino]ethyl}-2-[(3-methylphenyl)formamido]-3-(2,3,4,5,6-pentafluorophenyl)propanamide::arylaminoethyl amide, 5u
SMILES: COc1ccc(NCCNC(=O)[C@H](Cc2c(F)c(F)c(F)c(F)c2F)NC(=O)c2cccc(C)c2)cc1
InChI Key: InChIKey=XSNHMLRAMNDWFZ-IBGZPJMESA-N
Data: 3 KI
Activity Spreadsheet -- Enzyme Inhibition Constant Data from BindingDB
Found 3 hits for monomerid = 19567
Trg + Lig
Ki
nM
ΔG°
kcal/mole
IC50
nM
Kd
nM
EC50/IC50
nM
koff
s-1
kon
M-1s-1
pHTemp
°C
Procathepsin L
(Homo sapiens (Human))
BDBM19567
((2S)-N-{2-[(4-methoxyphenyl)amino]ethyl}-2-[(3-met...)
Show SMILES COc1ccc(NCCNC(=O)[C@H](Cc2c(F)c(F)c(F)c(F)c2F)NC(=O)c2cccc(C)c2)cc1 |r|
Show InChI InChI=1S/C26H24F5N3O3/c1-14-4-3-5-15(12-14)25(35)34-19(13-18-20(27)22(29)24(31)23(30)21(18)28)26(36)33-11-10-32-16-6-8-17(37-2)9-7-16/h3-9,12,19,32H,10-11,13H2,1-2H3,(H,33,36)(H,34,35)/t19-/m0/s1
Reactome pathway
25n/an/an/an/an/an/an/an/a
GNF
Assay Description
The recombinant human cathepsin enzyme was preincubated with inhibitor for 20 minutes prior to addition of substrate. The substrate hydrolysis was mo...
Bioorg Med Chem Lett 15: 4979-84 (2005)
Article DOI: 10.1016/j.bmcl.2005.08.017
BindingDB Entry DOI: 10.7270/Q2ZG6QJ8
Cathepsin S
(Homo sapiens (Human))
BDBM19567
((2S)-N-{2-[(4-methoxyphenyl)amino]ethyl}-2-[(3-met...)
Show SMILES COc1ccc(NCCNC(=O)[C@H](Cc2c(F)c(F)c(F)c(F)c2F)NC(=O)c2cccc(C)c2)cc1 |r|
Show InChI InChI=1S/C26H24F5N3O3/c1-14-4-3-5-15(12-14)25(35)34-19(13-18-20(27)22(29)24(31)23(30)21(18)28)26(36)33-11-10-32-16-6-8-17(37-2)9-7-16/h3-9,12,19,32H,10-11,13H2,1-2H3,(H,33,36)(H,34,35)/t19-/m0/s1
Reactome pathway
>2.00E+4>-6.66n/an/an/an/an/a5.537
GNF
Assay Description
The recombinant human cathepsin enzyme was preincubated with inhibitor for 20 minutes prior to addition of substrate. The substrate hydrolysis was mo...
Bioorg Med Chem Lett 15: 4979-84 (2005)
Article DOI: 10.1016/j.bmcl.2005.08.017
BindingDB Entry DOI: 10.7270/Q2ZG6QJ8
Cathepsin K
(Homo sapiens (Human))
BDBM19567
((2S)-N-{2-[(4-methoxyphenyl)amino]ethyl}-2-[(3-met...)
Show SMILES COc1ccc(NCCNC(=O)[C@H](Cc2c(F)c(F)c(F)c(F)c2F)NC(=O)c2cccc(C)c2)cc1 |r|
Show InChI InChI=1S/C26H24F5N3O3/c1-14-4-3-5-15(12-14)25(35)34-19(13-18-20(27)22(29)24(31)23(30)21(18)28)26(36)33-11-10-32-16-6-8-17(37-2)9-7-16/h3-9,12,19,32H,10-11,13H2,1-2H3,(H,33,36)(H,34,35)/t19-/m0/s1
Reactome pathway
>1.00E+5n/an/an/an/an/an/an/an/a
GNF
Assay Description
The recombinant human cathepsin enzyme was preincubated with inhibitor for 20 minutes prior to addition of substrate. The substrate hydrolysis was mo...
Bioorg Med Chem Lett 15: 4979-84 (2005)
Article DOI: 10.1016/j.bmcl.2005.08.017
BindingDB Entry DOI: 10.7270/Q2ZG6QJ8