BDBM195777 US9206188, 28::US9834551, Example 28
SMILES: CCN(CC)S(=O)(=O)c1cccc(c1)-c1c[nH]c2ncc(cc12)-c1cccc(NC(=O)C=C)c1
InChI Key: InChIKey=QARWIBDBHJDCCL-UHFFFAOYSA-N
Data: 6 IC50
Activity Spreadsheet -- Enzyme Inhibition Constant Data from BindingDB
Found 6 hits for monomerid = 195777
Trg + Lig
Ki
nM
ΔG°
kcal/mole
IC50
nM
Kd
nM
EC50/IC50
nM
koff
s-1
kon
M-1s-1
pHTemp
°C
Tyrosine-protein kinase ITK/TSK
(Homo sapiens (Human))
BDBM195777
(US9206188, 28 | US9834551, Example 28)
Show SMILES CCN(CC)S(=O)(=O)c1cccc(c1)-c1c[nH]c2ncc(cc12)-c1cccc(NC(=O)C=C)c1
Show InChI InChI=1S/C26H26N4O3S/c1-4-25(31)29-21-11-7-9-18(13-21)20-15-23-24(17-28-26(23)27-16-20)19-10-8-12-22(14-19)34(32,33)30(5-2)6-3/h4,7-17H,1,5-6H2,2-3H3,(H,27,28)(H,29,31)
Reactome pathway
US Patent
n/an/a 30n/an/an/an/an/an/a
ARRIEN PHARMACEUTICALS LLC
US Patent
Assay Description
1H-pyrrolo[2,3-b]pyridine, 1H-pyrazolo[3,4-b]pyridine and 5H-pyrrolo[2,3-b]pyrazine series of compounds exhibited over >100 fold selective against Ja...
US Patent US9206188 (2015)
BindingDB Entry DOI: 10.7270/Q2057DRT
Tyrosine-protein kinase BTK
(Homo sapiens (Human))
BDBM195777
(US9206188, 28 | US9834551, Example 28)
Show SMILES CCN(CC)S(=O)(=O)c1cccc(c1)-c1c[nH]c2ncc(cc12)-c1cccc(NC(=O)C=C)c1
Show InChI InChI=1S/C26H26N4O3S/c1-4-25(31)29-21-11-7-9-18(13-21)20-15-23-24(17-28-26(23)27-16-20)19-10-8-12-22(14-19)34(32,33)30(5-2)6-3/h4,7-17H,1,5-6H2,2-3H3,(H,27,28)(H,29,31)
NCI pathway
Reactome pathway
US Patent
n/an/a 739n/an/an/an/an/an/a
ARRIEN PHARMACEUTICALS LLC
US Patent
Assay Description
1H-pyrrolo[2,3-b]pyridine, 1H-pyrazolo[3,4-b]pyridine and 5H-pyrrolo[2,3-b]pyrazine series of compounds exhibited over >100 fold selective against Ja...
US Patent US9206188 (2015)
BindingDB Entry DOI: 10.7270/Q2057DRT
Tyrosine-protein kinase JAK3
(Homo sapiens (Human))
BDBM195777
(US9206188, 28 | US9834551, Example 28)
Show SMILES CCN(CC)S(=O)(=O)c1cccc(c1)-c1c[nH]c2ncc(cc12)-c1cccc(NC(=O)C=C)c1
Show InChI InChI=1S/C26H26N4O3S/c1-4-25(31)29-21-11-7-9-18(13-21)20-15-23-24(17-28-26(23)27-16-20)19-10-8-12-22(14-19)34(32,33)30(5-2)6-3/h4,7-17H,1,5-6H2,2-3H3,(H,27,28)(H,29,31)
Reactome pathway
US Patent
n/an/a<100n/an/an/an/an/an/a
ARRIEN PHARMACEUTICALS LLC
US Patent
Assay Description
ITK and JAK3 Kinase assay procedures:Enzyme was incubated with substrate peptide in reaction buffer in the presence and absence of test compounds or ...
US Patent US9834551 (2017)
BindingDB Entry DOI: 10.7270/Q2PZ5C4Q
Tyrosine-protein kinase JAK3
(Homo sapiens (Human))
BDBM195777
(US9206188, 28 | US9834551, Example 28)
Show SMILES CCN(CC)S(=O)(=O)c1cccc(c1)-c1c[nH]c2ncc(cc12)-c1cccc(NC(=O)C=C)c1
Show InChI InChI=1S/C26H26N4O3S/c1-4-25(31)29-21-11-7-9-18(13-21)20-15-23-24(17-28-26(23)27-16-20)19-10-8-12-22(14-19)34(32,33)30(5-2)6-3/h4,7-17H,1,5-6H2,2-3H3,(H,27,28)(H,29,31)
Reactome pathway
US Patent
n/an/a<5n/an/an/an/an/an/a
ARRIEN PHARMACEUTICALS LLC
US Patent
Assay Description
1H-pyrrolo[2,3-b]pyridine, 1H-pyrazolo[3,4-b]pyridine and 5H-pyrrolo[2,3-b]pyrazine series of compounds exhibited over >100 fold selective against Ja...
US Patent US9206188 (2015)
BindingDB Entry DOI: 10.7270/Q2057DRT
Tyrosine-protein kinase ITK/TSK
(Homo sapiens (Human))
BDBM195777
(US9206188, 28 | US9834551, Example 28)
Show SMILES CCN(CC)S(=O)(=O)c1cccc(c1)-c1c[nH]c2ncc(cc12)-c1cccc(NC(=O)C=C)c1
Show InChI InChI=1S/C26H26N4O3S/c1-4-25(31)29-21-11-7-9-18(13-21)20-15-23-24(17-28-26(23)27-16-20)19-10-8-12-22(14-19)34(32,33)30(5-2)6-3/h4,7-17H,1,5-6H2,2-3H3,(H,27,28)(H,29,31)
Reactome pathway
US Patent
n/an/a<100n/an/an/an/an/an/a
ARRIEN PHARMACEUTICALS LLC
US Patent
Assay Description
ITK and JAK3 Kinase assay procedures:Enzyme was incubated with substrate peptide in reaction buffer in the presence and absence of test compounds or ...
US Patent US9834551 (2017)
BindingDB Entry DOI: 10.7270/Q2PZ5C4Q
Tyrosine-protein kinase ITK/TSK
(Homo sapiens (Human))
BDBM195777
(US9206188, 28 | US9834551, Example 28)
Show SMILES CCN(CC)S(=O)(=O)c1cccc(c1)-c1c[nH]c2ncc(cc12)-c1cccc(NC(=O)C=C)c1
Show InChI InChI=1S/C26H26N4O3S/c1-4-25(31)29-21-11-7-9-18(13-21)20-15-23-24(17-28-26(23)27-16-20)19-10-8-12-22(14-19)34(32,33)30(5-2)6-3/h4,7-17H,1,5-6H2,2-3H3,(H,27,28)(H,29,31)
Reactome pathway
US Patent
n/an/a 35n/an/an/an/an/an/a
ARRIEN PHARMACEUTICALS LLC
US Patent
Assay Description
1H-pyrrolo[2,3-b]pyridine, 1H-pyrazolo[3,4-b]pyridine and 5H-pyrrolo[2,3-b]pyrazine series of compounds exhibited over >100 fold selective against Ja...
US Patent US9206188 (2015)
BindingDB Entry DOI: 10.7270/Q2057DRT