BDBM195779 US9206188, 30::US9834551, Example 30
SMILES: COc1c(F)cc(F)cc1-c1c[nH]c2ncc(cc12)-c1cccc(NC(=O)C=C)c1
InChI Key: InChIKey=FFYPNJOCHRXBDA-UHFFFAOYSA-N
Data: 6 IC50
Activity Spreadsheet -- Enzyme Inhibition Constant Data from BindingDB
Found 6 hits for monomerid = 195779
Trg + Lig
Ki
nM
ΔG°
kcal/mole
IC50
nM
Kd
nM
EC50/IC50
nM
koff
s-1
kon
M-1s-1
pHTemp
°C
Tyrosine-protein kinase ITK/TSK
(Homo sapiens (Human))
BDBM195779
(US9206188, 30 | US9834551, Example 30)
Show SMILES COc1c(F)cc(F)cc1-c1c[nH]c2ncc(cc12)-c1cccc(NC(=O)C=C)c1
Show InChI InChI=1S/C23H17F2N3O2/c1-3-21(29)28-16-6-4-5-13(7-16)14-8-18-19(12-27-23(18)26-11-14)17-9-15(24)10-20(25)22(17)30-2/h3-12H,1H2,2H3,(H,26,27)(H,28,29)
Reactome pathway
US Patent
n/an/a 30n/an/an/an/an/an/a
ARRIEN PHARMACEUTICALS LLC
US Patent
Assay Description
1H-pyrrolo[2,3-b]pyridine, 1H-pyrazolo[3,4-b]pyridine and 5H-pyrrolo[2,3-b]pyrazine series of compounds exhibited over >100 fold selective against Ja...
US Patent US9206188 (2015)
BindingDB Entry DOI: 10.7270/Q2057DRT
Tyrosine-protein kinase BTK
(Homo sapiens (Human))
BDBM195779
(US9206188, 30 | US9834551, Example 30)
Show SMILES COc1c(F)cc(F)cc1-c1c[nH]c2ncc(cc12)-c1cccc(NC(=O)C=C)c1
Show InChI InChI=1S/C23H17F2N3O2/c1-3-21(29)28-16-6-4-5-13(7-16)14-8-18-19(12-27-23(18)26-11-14)17-9-15(24)10-20(25)22(17)30-2/h3-12H,1H2,2H3,(H,26,27)(H,28,29)
NCI pathway
Reactome pathway
US Patent
n/an/a 739n/an/an/an/an/an/a
ARRIEN PHARMACEUTICALS LLC
US Patent
Assay Description
1H-pyrrolo[2,3-b]pyridine, 1H-pyrazolo[3,4-b]pyridine and 5H-pyrrolo[2,3-b]pyrazine series of compounds exhibited over >100 fold selective against Ja...
US Patent US9206188 (2015)
BindingDB Entry DOI: 10.7270/Q2057DRT
Tyrosine-protein kinase JAK3
(Homo sapiens (Human))
BDBM195779
(US9206188, 30 | US9834551, Example 30)
Show SMILES COc1c(F)cc(F)cc1-c1c[nH]c2ncc(cc12)-c1cccc(NC(=O)C=C)c1
Show InChI InChI=1S/C23H17F2N3O2/c1-3-21(29)28-16-6-4-5-13(7-16)14-8-18-19(12-27-23(18)26-11-14)17-9-15(24)10-20(25)22(17)30-2/h3-12H,1H2,2H3,(H,26,27)(H,28,29)
Reactome pathway
US Patent
n/an/a<100n/an/an/an/an/an/a
ARRIEN PHARMACEUTICALS LLC
US Patent
Assay Description
ITK and JAK3 Kinase assay procedures:Enzyme was incubated with substrate peptide in reaction buffer in the presence and absence of test compounds or ...
US Patent US9834551 (2017)
BindingDB Entry DOI: 10.7270/Q2PZ5C4Q
Tyrosine-protein kinase JAK3
(Homo sapiens (Human))
BDBM195779
(US9206188, 30 | US9834551, Example 30)
Show SMILES COc1c(F)cc(F)cc1-c1c[nH]c2ncc(cc12)-c1cccc(NC(=O)C=C)c1
Show InChI InChI=1S/C23H17F2N3O2/c1-3-21(29)28-16-6-4-5-13(7-16)14-8-18-19(12-27-23(18)26-11-14)17-9-15(24)10-20(25)22(17)30-2/h3-12H,1H2,2H3,(H,26,27)(H,28,29)
Reactome pathway
US Patent
n/an/a<5n/an/an/an/an/an/a
ARRIEN PHARMACEUTICALS LLC
US Patent
Assay Description
1H-pyrrolo[2,3-b]pyridine, 1H-pyrazolo[3,4-b]pyridine and 5H-pyrrolo[2,3-b]pyrazine series of compounds exhibited over >100 fold selective against Ja...
US Patent US9206188 (2015)
BindingDB Entry DOI: 10.7270/Q2057DRT
Tyrosine-protein kinase ITK/TSK
(Homo sapiens (Human))
BDBM195779
(US9206188, 30 | US9834551, Example 30)
Show SMILES COc1c(F)cc(F)cc1-c1c[nH]c2ncc(cc12)-c1cccc(NC(=O)C=C)c1
Show InChI InChI=1S/C23H17F2N3O2/c1-3-21(29)28-16-6-4-5-13(7-16)14-8-18-19(12-27-23(18)26-11-14)17-9-15(24)10-20(25)22(17)30-2/h3-12H,1H2,2H3,(H,26,27)(H,28,29)
Reactome pathway
US Patent
n/an/a<100n/an/an/an/an/an/a
ARRIEN PHARMACEUTICALS LLC
US Patent
Assay Description
ITK and JAK3 Kinase assay procedures:Enzyme was incubated with substrate peptide in reaction buffer in the presence and absence of test compounds or ...
US Patent US9834551 (2017)
BindingDB Entry DOI: 10.7270/Q2PZ5C4Q
Tyrosine-protein kinase ITK/TSK
(Homo sapiens (Human))
BDBM195779
(US9206188, 30 | US9834551, Example 30)
Show SMILES COc1c(F)cc(F)cc1-c1c[nH]c2ncc(cc12)-c1cccc(NC(=O)C=C)c1
Show InChI InChI=1S/C23H17F2N3O2/c1-3-21(29)28-16-6-4-5-13(7-16)14-8-18-19(12-27-23(18)26-11-14)17-9-15(24)10-20(25)22(17)30-2/h3-12H,1H2,2H3,(H,26,27)(H,28,29)
Reactome pathway
US Patent
n/an/a 35n/an/an/an/an/an/a
ARRIEN PHARMACEUTICALS LLC
US Patent
Assay Description
1H-pyrrolo[2,3-b]pyridine, 1H-pyrazolo[3,4-b]pyridine and 5H-pyrrolo[2,3-b]pyrazine series of compounds exhibited over >100 fold selective against Ja...
US Patent US9206188 (2015)
BindingDB Entry DOI: 10.7270/Q2057DRT