BDBM196143 US9211296, Table 7, Compd: 16
SMILES: OC(=O)c1ccc(CS(=O)(=O)c2ccccc2)o1
InChI Key: InChIKey=JAYCQRGXFORAAZ-UHFFFAOYSA-N
Data: 1 IC50
Activity Spreadsheet -- Enzyme Inhibition Constant Data from BindingDB
Found 1 hit for monomerid = 196143
Trg + Lig
Ki
nM
ΔG°
kcal/mole
IC50
nM
Kd
nM
EC50/IC50
nM
koff
s-1
kon
M-1s-1
pHTemp
°C
DNA Synthesis
(Vaccinia virus (strain WR))
BDBM196143
(US9211296, Table 7, Compd: 16)
Show SMILES OC(=O)c1ccc(CS(=O)(=O)c2ccccc2)o1
Show InChI InChI=1S/C12H10O5S/c13-12(14)11-7-6-9(17-11)8-18(15,16)10-4-2-1-3-5-10/h1-7H,8H2,(H,13,14)
US Patent
n/an/a 7.40E+3n/an/an/an/a7.437
The Trustees of the University of Pennsylvania
US Patent
Assay Description
A rapid plate DNA synthesis assay was performed using optimized conditions. Briefly, a 1.2:1 ratio of a 20-mer oligonucleotide primer (5′-GCGAA...
US Patent US9211296 (2015)
BindingDB Entry DOI: 10.7270/Q2G73CHS