BDBM196150 US9211296, Table 6, 4
SMILES: Cc1csc2c(ncnc12)N1CCN(CC1)C(=O)NC(C)(C)C
InChI Key: InChIKey=LTFFUMIEGIJWTG-UHFFFAOYSA-N
Data: 1 IC50
Activity Spreadsheet -- Enzyme Inhibition Constant Data from BindingDB
Found 1 hit for monomerid = 196150
Trg + Lig
Ki
nM
ΔG°
kcal/mole
IC50
nM
Kd
nM
EC50/IC50
nM
koff
s-1
kon
M-1s-1
pHTemp
°C
DNA Synthesis
(Vaccinia virus (strain WR))
BDBM196150
(US9211296, Table 6, 4)
Show SMILES Cc1csc2c(ncnc12)N1CCN(CC1)C(=O)NC(C)(C)C
Show InChI InChI=1S/C16H23N5OS/c1-11-9-23-13-12(11)17-10-18-14(13)20-5-7-21(8-6-20)15(22)19-16(2,3)4/h9-10H,5-8H2,1-4H3,(H,19,22)
US Patent
n/an/a 1.20E+4n/an/an/an/a7.437
The Trustees of the University of Pennsylvania
US Patent
Assay Description
A rapid plate DNA synthesis assay was performed using optimized conditions. Briefly, a 1.2:1 ratio of a 20-mer oligonucleotide primer (5′-GCGAA...
US Patent US9211296 (2015)
BindingDB Entry DOI: 10.7270/Q2G73CHS