null
SMILES: CCS(=O)(=O)N1CCN=C1SCc1ccc(Cl)cc1Cl
InChI Key: InChIKey=ATRIIDNYXNTQEA-UHFFFAOYSA-N
Activity Spreadsheet -- Enzyme Inhibition Constant Data from BindingDB
Found 1 hit for monomerid = 196156
Trg + Lig
Ki
nM
ΔG°
kcal/mole
IC50
nM
Kd
nM
EC50/IC50
nM
koff
s-1
kon
M-1s-1
pHTemp
°C
DNA polymerase
(Vaccinia virus (strain WR))
BDBM196156
(US9211296, Table 6, 10)
Show SMILES CCS(=O)(=O)N1CCN=C1SCc1ccc(Cl)cc1Cl |c:8|
Show InChI InChI=1S/C12H14Cl2N2O2S2/c1-2-20(17,18)16-6-5-15-12(16)19-8-9-3-4-10(13)7-11(9)14/h3-4,7H,2,5-6,8H2,1H3
US Patent
n/an/a 1.88E+5n/an/an/an/a7.437
The Trustees of the University of Pennsylvania
US Patent
Assay Description
A rapid plate DNA synthesis assay was performed using optimized conditions. Briefly, a 1.2:1 ratio of a 20-mer oligonucleotide primer (5′-GCGAA...
US Patent US9211296 (2015)
BindingDB Entry DOI: 10.7270/Q2G73CHS