BDBM19623 (2S)-2-[(7-chloro-1,3-benzoxazol-2-yl)amino]-3-cyclohexyl-N-[(2S)-1-[(4-methanesulfonylphenyl)amino]propan-2-yl]propanamide::Heterocyclic arylaminoethyl amide, 12b
SMILES: C[C@@H](CNc1ccc(cc1)S(C)(=O)=O)NC(=O)[C@H](CC1CCCCC1)Nc1nc2cccc(Cl)c2o1
InChI Key: InChIKey=ZLQFJLTZZDELFZ-SBUREZEXSA-N
Data: 3 KI
Activity Spreadsheet -- Enzyme Inhibition Constant Data from BindingDB
Found 3 hits for monomerid = 19623
Trg + Lig
Ki
nM
ΔG°
kcal/mole
IC50
nM
Kd
nM
EC50/IC50
nM
koff
s-1
kon
M-1s-1
pHTemp
°C
Cathepsin S
(Homo sapiens (Human))
BDBM19623
((2S)-2-[(7-chloro-1,3-benzoxazol-2-yl)amino]-3-cyc...)
Show SMILES C[C@@H](CNc1ccc(cc1)S(C)(=O)=O)NC(=O)[C@H](CC1CCCCC1)Nc1nc2cccc(Cl)c2o1 |r|
Show InChI InChI=1S/C26H33ClN4O4S/c1-17(16-28-19-11-13-20(14-12-19)36(2,33)34)29-25(32)23(15-18-7-4-3-5-8-18)31-26-30-22-10-6-9-21(27)24(22)35-26/h6,9-14,17-18,23,28H,3-5,7-8,15-16H2,1-2H3,(H,29,32)(H,30,31)/t17-,23-/m0/s1
Reactome pathway
11 -11.3n/an/an/an/an/a5.537
GNF
Assay Description
The recombinant human cathepsin enzyme was preincubated with inhibitor for 20 minutes prior to addition of substrate. The substrate hydrolysis was mo...
Bioorg Med Chem Lett 16: 1975-80 (2006)
Article DOI: 10.1016/j.bmcl.2005.12.095
BindingDB Entry DOI: 10.7270/Q2PZ573M
Procathepsin L
(Homo sapiens (Human))
BDBM19623
((2S)-2-[(7-chloro-1,3-benzoxazol-2-yl)amino]-3-cyc...)
Show SMILES C[C@@H](CNc1ccc(cc1)S(C)(=O)=O)NC(=O)[C@H](CC1CCCCC1)Nc1nc2cccc(Cl)c2o1 |r|
Show InChI InChI=1S/C26H33ClN4O4S/c1-17(16-28-19-11-13-20(14-12-19)36(2,33)34)29-25(32)23(15-18-7-4-3-5-8-18)31-26-30-22-10-6-9-21(27)24(22)35-26/h6,9-14,17-18,23,28H,3-5,7-8,15-16H2,1-2H3,(H,29,32)(H,30,31)/t17-,23-/m0/s1
Reactome pathway
108n/an/an/an/an/an/an/an/a
GNF
Assay Description
The recombinant human cathepsin enzyme was preincubated with inhibitor for 20 minutes prior to addition of substrate. The substrate hydrolysis was mo...
Bioorg Med Chem Lett 16: 1975-80 (2006)
Article DOI: 10.1016/j.bmcl.2005.12.095
BindingDB Entry DOI: 10.7270/Q2PZ573M
Cathepsin K
(Homo sapiens (Human))
BDBM19623
((2S)-2-[(7-chloro-1,3-benzoxazol-2-yl)amino]-3-cyc...)
Show SMILES C[C@@H](CNc1ccc(cc1)S(C)(=O)=O)NC(=O)[C@H](CC1CCCCC1)Nc1nc2cccc(Cl)c2o1 |r|
Show InChI InChI=1S/C26H33ClN4O4S/c1-17(16-28-19-11-13-20(14-12-19)36(2,33)34)29-25(32)23(15-18-7-4-3-5-8-18)31-26-30-22-10-6-9-21(27)24(22)35-26/h6,9-14,17-18,23,28H,3-5,7-8,15-16H2,1-2H3,(H,29,32)(H,30,31)/t17-,23-/m0/s1
Reactome pathway
1.05E+3n/an/an/an/an/an/an/an/a
GNF
Assay Description
The recombinant human cathepsin enzyme was preincubated with inhibitor for 20 minutes prior to addition of substrate. The substrate hydrolysis was mo...
Bioorg Med Chem Lett 16: 1975-80 (2006)
Article DOI: 10.1016/j.bmcl.2005.12.095
BindingDB Entry DOI: 10.7270/Q2PZ573M