BDBM19631 (2S)-2-(1,3-benzoxazol-2-ylamino)-N-[(2R)-1-(benzyloxy)-3-(5-fluoro-2,3-dihydro-1H-indol-1-yl)propan-2-yl]-3-cyclohexylpropanamide::Heterocyclic arylaminoethyl amide, 13c
SMILES: Fc1ccc2N(C[C@H](COCc3ccccc3)NC(=O)[C@H](CC3CCCCC3)Nc3nc4ccccc4o3)CCc2c1
InChI Key: InChIKey=YYDWMUXZSMHCTN-DGPALRBDSA-N
Data: 3 KI
Activity Spreadsheet -- Enzyme Inhibition Constant Data from BindingDB
Found 3 hits for monomerid = 19631
Trg + Lig
Ki
nM
ΔG°
kcal/mole
IC50
nM
Kd
nM
EC50/IC50
nM
koff
s-1
kon
M-1s-1
pHTemp
°C
Cathepsin S
(Homo sapiens (Human))
BDBM19631
((2S)-2-(1,3-benzoxazol-2-ylamino)-N-[(2R)-1-(benzy...)
Show SMILES Fc1ccc2N(C[C@H](COCc3ccccc3)NC(=O)[C@H](CC3CCCCC3)Nc3nc4ccccc4o3)CCc2c1 |r|
Show InChI InChI=1S/C34H39FN4O3/c35-27-15-16-31-26(20-27)17-18-39(31)21-28(23-41-22-25-11-5-2-6-12-25)36-33(40)30(19-24-9-3-1-4-10-24)38-34-37-29-13-7-8-14-32(29)42-34/h2,5-8,11-16,20,24,28,30H,1,3-4,9-10,17-19,21-23H2,(H,36,40)(H,37,38)/t28-,30+/m1/s1
Reactome pathway
5 -11.8n/an/an/an/an/a5.537
GNF
Assay Description
The recombinant human cathepsin enzyme was preincubated with inhibitor for 20 minutes prior to addition of substrate. The substrate hydrolysis was mo...
Bioorg Med Chem Lett 16: 1975-80 (2006)
Article DOI: 10.1016/j.bmcl.2005.12.095
BindingDB Entry DOI: 10.7270/Q2PZ573M
Procathepsin L
(Homo sapiens (Human))
BDBM19631
((2S)-2-(1,3-benzoxazol-2-ylamino)-N-[(2R)-1-(benzy...)
Show SMILES Fc1ccc2N(C[C@H](COCc3ccccc3)NC(=O)[C@H](CC3CCCCC3)Nc3nc4ccccc4o3)CCc2c1 |r|
Show InChI InChI=1S/C34H39FN4O3/c35-27-15-16-31-26(20-27)17-18-39(31)21-28(23-41-22-25-11-5-2-6-12-25)36-33(40)30(19-24-9-3-1-4-10-24)38-34-37-29-13-7-8-14-32(29)42-34/h2,5-8,11-16,20,24,28,30H,1,3-4,9-10,17-19,21-23H2,(H,36,40)(H,37,38)/t28-,30+/m1/s1
Reactome pathway
1.49E+3n/an/an/an/an/an/an/an/a
GNF
Assay Description
The recombinant human cathepsin enzyme was preincubated with inhibitor for 20 minutes prior to addition of substrate. The substrate hydrolysis was mo...
Bioorg Med Chem Lett 16: 1975-80 (2006)
Article DOI: 10.1016/j.bmcl.2005.12.095
BindingDB Entry DOI: 10.7270/Q2PZ573M
Cathepsin K
(Homo sapiens (Human))
BDBM19631
((2S)-2-(1,3-benzoxazol-2-ylamino)-N-[(2R)-1-(benzy...)
Show SMILES Fc1ccc2N(C[C@H](COCc3ccccc3)NC(=O)[C@H](CC3CCCCC3)Nc3nc4ccccc4o3)CCc2c1 |r|
Show InChI InChI=1S/C34H39FN4O3/c35-27-15-16-31-26(20-27)17-18-39(31)21-28(23-41-22-25-11-5-2-6-12-25)36-33(40)30(19-24-9-3-1-4-10-24)38-34-37-29-13-7-8-14-32(29)42-34/h2,5-8,11-16,20,24,28,30H,1,3-4,9-10,17-19,21-23H2,(H,36,40)(H,37,38)/t28-,30+/m1/s1
Reactome pathway
1.67E+4n/an/an/an/an/an/an/an/a
GNF
Assay Description
The recombinant human cathepsin enzyme was preincubated with inhibitor for 20 minutes prior to addition of substrate. The substrate hydrolysis was mo...
Bioorg Med Chem Lett 16: 1975-80 (2006)
Article DOI: 10.1016/j.bmcl.2005.12.095
BindingDB Entry DOI: 10.7270/Q2PZ573M