null
SMILES: CS(=O)(=O)CC[C@@H](CN1CCc2cc(F)ccc12)NC(=O)[C@H](CC1CCCCC1)Nc1nc2ccc(Cl)cc2o1
InChI Key: InChIKey=FSXZTYDYWLKOJJ-ZCYQVOJMSA-N
Activity Spreadsheet -- Enzyme Inhibition Constant Data from BindingDB
Found 3 hits for monomerid = 19633
Trg + Lig
Ki
nM
ΔG°
kcal/mole
IC50
nM
Kd
nM
EC50/IC50
nM
koff
s-1
kon
M-1s-1
pHTemp
°C
Cathepsin S
(Homo sapiens (Human))
BDBM19633
((2S)-2-[(6-chloro-1,3-benzoxazol-2-yl)amino]-3-cyc...)
Show SMILES CS(=O)(=O)CC[C@@H](CN1CCc2cc(F)ccc12)NC(=O)[C@H](CC1CCCCC1)Nc1nc2ccc(Cl)cc2o1 |r|
Show InChI InChI=1S/C29H36ClFN4O4S/c1-40(37,38)14-12-23(18-35-13-11-20-16-22(31)8-10-26(20)35)32-28(36)25(15-19-5-3-2-4-6-19)34-29-33-24-9-7-21(30)17-27(24)39-29/h7-10,16-17,19,23,25H,2-6,11-15,18H2,1H3,(H,32,36)(H,33,34)/t23-,25-/m0/s1
Reactome pathway
21 -10.9n/an/an/an/an/a5.537
GNF
Assay Description
The recombinant human cathepsin enzyme was preincubated with inhibitor for 20 minutes prior to addition of substrate. The substrate hydrolysis was mo...
Bioorg Med Chem Lett 16: 1975-80 (2006)
Article DOI: 10.1016/j.bmcl.2005.12.095
BindingDB Entry DOI: 10.7270/Q2PZ573M
Procathepsin L
(Homo sapiens (Human))
BDBM19633
((2S)-2-[(6-chloro-1,3-benzoxazol-2-yl)amino]-3-cyc...)
Show SMILES CS(=O)(=O)CC[C@@H](CN1CCc2cc(F)ccc12)NC(=O)[C@H](CC1CCCCC1)Nc1nc2ccc(Cl)cc2o1 |r|
Show InChI InChI=1S/C29H36ClFN4O4S/c1-40(37,38)14-12-23(18-35-13-11-20-16-22(31)8-10-26(20)35)32-28(36)25(15-19-5-3-2-4-6-19)34-29-33-24-9-7-21(30)17-27(24)39-29/h7-10,16-17,19,23,25H,2-6,11-15,18H2,1H3,(H,32,36)(H,33,34)/t23-,25-/m0/s1
Reactome pathway
369n/an/an/an/an/an/an/an/a
GNF
Assay Description
The recombinant human cathepsin enzyme was preincubated with inhibitor for 20 minutes prior to addition of substrate. The substrate hydrolysis was mo...
Bioorg Med Chem Lett 16: 1975-80 (2006)
Article DOI: 10.1016/j.bmcl.2005.12.095
BindingDB Entry DOI: 10.7270/Q2PZ573M
Cathepsin K
(Homo sapiens (Human))
BDBM19633
((2S)-2-[(6-chloro-1,3-benzoxazol-2-yl)amino]-3-cyc...)
Show SMILES CS(=O)(=O)CC[C@@H](CN1CCc2cc(F)ccc12)NC(=O)[C@H](CC1CCCCC1)Nc1nc2ccc(Cl)cc2o1 |r|
Show InChI InChI=1S/C29H36ClFN4O4S/c1-40(37,38)14-12-23(18-35-13-11-20-16-22(31)8-10-26(20)35)32-28(36)25(15-19-5-3-2-4-6-19)34-29-33-24-9-7-21(30)17-27(24)39-29/h7-10,16-17,19,23,25H,2-6,11-15,18H2,1H3,(H,32,36)(H,33,34)/t23-,25-/m0/s1
Reactome pathway
4.87E+3n/an/an/an/an/an/an/an/a
GNF
Assay Description
The recombinant human cathepsin enzyme was preincubated with inhibitor for 20 minutes prior to addition of substrate. The substrate hydrolysis was mo...
Bioorg Med Chem Lett 16: 1975-80 (2006)
Article DOI: 10.1016/j.bmcl.2005.12.095
BindingDB Entry DOI: 10.7270/Q2PZ573M