null
SMILES: OC(=O)C[C@@H](CN1CCc2cc(F)ccc12)NC(=O)[C@H](CC1CCCCC1)Nc1nc2ccccc2o1
InChI Key: InChIKey=PLORMMYDFRWDDE-GMAHTHKFSA-N
Activity Spreadsheet -- Enzyme Inhibition Constant Data from BindingDB
Found 3 hits for monomerid = 19634
Trg + Lig
Ki
nM
ΔG°
kcal/mole
IC50
nM
Kd
nM
EC50/IC50
nM
koff
s-1
kon
M-1s-1
pHTemp
°C
Cathepsin S
(Homo sapiens (Human))
BDBM19634
((3S)-3-[(2S)-2-(1,3-benzoxazol-2-ylamino)-3-cycloh...)
Show SMILES OC(=O)C[C@@H](CN1CCc2cc(F)ccc12)NC(=O)[C@H](CC1CCCCC1)Nc1nc2ccccc2o1 |r|
Show InChI InChI=1S/C28H33FN4O4/c29-20-10-11-24-19(15-20)12-13-33(24)17-21(16-26(34)35)30-27(36)23(14-18-6-2-1-3-7-18)32-28-31-22-8-4-5-9-25(22)37-28/h4-5,8-11,15,18,21,23H,1-3,6-7,12-14,16-17H2,(H,30,36)(H,31,32)(H,34,35)/t21-,23-/m0/s1
Reactome pathway
12 -11.2n/an/an/an/an/a5.537
GNF
Assay Description
The recombinant human cathepsin enzyme was preincubated with inhibitor for 20 minutes prior to addition of substrate. The substrate hydrolysis was mo...
Bioorg Med Chem Lett 16: 1975-80 (2006)
Article DOI: 10.1016/j.bmcl.2005.12.095
BindingDB Entry DOI: 10.7270/Q2PZ573M
Procathepsin L
(Homo sapiens (Human))
BDBM19634
((3S)-3-[(2S)-2-(1,3-benzoxazol-2-ylamino)-3-cycloh...)
Show SMILES OC(=O)C[C@@H](CN1CCc2cc(F)ccc12)NC(=O)[C@H](CC1CCCCC1)Nc1nc2ccccc2o1 |r|
Show InChI InChI=1S/C28H33FN4O4/c29-20-10-11-24-19(15-20)12-13-33(24)17-21(16-26(34)35)30-27(36)23(14-18-6-2-1-3-7-18)32-28-31-22-8-4-5-9-25(22)37-28/h4-5,8-11,15,18,21,23H,1-3,6-7,12-14,16-17H2,(H,30,36)(H,31,32)(H,34,35)/t21-,23-/m0/s1
Reactome pathway
>1.00E+4n/an/an/an/an/an/an/an/a
GNF
Assay Description
The recombinant human cathepsin enzyme was preincubated with inhibitor for 20 minutes prior to addition of substrate. The substrate hydrolysis was mo...
Bioorg Med Chem Lett 16: 1975-80 (2006)
Article DOI: 10.1016/j.bmcl.2005.12.095
BindingDB Entry DOI: 10.7270/Q2PZ573M
Cathepsin K
(Homo sapiens (Human))
BDBM19634
((3S)-3-[(2S)-2-(1,3-benzoxazol-2-ylamino)-3-cycloh...)
Show SMILES OC(=O)C[C@@H](CN1CCc2cc(F)ccc12)NC(=O)[C@H](CC1CCCCC1)Nc1nc2ccccc2o1 |r|
Show InChI InChI=1S/C28H33FN4O4/c29-20-10-11-24-19(15-20)12-13-33(24)17-21(16-26(34)35)30-27(36)23(14-18-6-2-1-3-7-18)32-28-31-22-8-4-5-9-25(22)37-28/h4-5,8-11,15,18,21,23H,1-3,6-7,12-14,16-17H2,(H,30,36)(H,31,32)(H,34,35)/t21-,23-/m0/s1
Reactome pathway
>2.00E+4n/an/an/an/an/an/an/an/a
GNF
Assay Description
The recombinant human cathepsin enzyme was preincubated with inhibitor for 20 minutes prior to addition of substrate. The substrate hydrolysis was mo...
Bioorg Med Chem Lett 16: 1975-80 (2006)
Article DOI: 10.1016/j.bmcl.2005.12.095
BindingDB Entry DOI: 10.7270/Q2PZ573M