BDBM19656 (2R)-2-(2-cyclopentylethyl)-4-(morpholin-4-yl)-4-oxo-N-[(2S)-4-phenyl-1-{[4-(trifluoromethoxy)phenyl]amino}butan-2-yl]butanamide::succinamide peptidomimetic, 22
SMILES: FC(F)(F)Oc1ccc(NC[C@H](CCc2ccccc2)NC(=O)[C@H](CCC2CCCC2)CC(=O)N2CCOCC2)cc1
InChI Key: InChIKey=UDGAOZLPEBAUEM-IAPPQJPRSA-N
Data: 3 KI
Activity Spreadsheet -- Enzyme Inhibition Constant Data from BindingDB
Found 3 hits for monomerid = 19656
Trg + Lig
Ki
nM
ΔG°
kcal/mole
IC50
nM
Kd
nM
EC50/IC50
nM
koff
s-1
kon
M-1s-1
pHTemp
°C
Cathepsin S
(Homo sapiens (Human))
BDBM19656
((2R)-2-(2-cyclopentylethyl)-4-(morpholin-4-yl)-4-o...)
Show SMILES FC(F)(F)Oc1ccc(NC[C@H](CCc2ccccc2)NC(=O)[C@H](CCC2CCCC2)CC(=O)N2CCOCC2)cc1 |r|
Show InChI InChI=1S/C32H42F3N3O4/c33-32(34,35)42-29-16-14-27(15-17-29)36-23-28(13-11-25-6-2-1-3-7-25)37-31(40)26(12-10-24-8-4-5-9-24)22-30(39)38-18-20-41-21-19-38/h1-3,6-7,14-17,24,26,28,36H,4-5,8-13,18-23H2,(H,37,40)/t26-,28+/m1/s1
Reactome pathway
20 -10.9n/an/an/an/an/a5.537
GNF
Assay Description
The recombinant human cathepsin enzyme was preincubated with inhibitor for 20 minutes prior to addition of substrate. The substrate hydrolysis was mo...
Bioorg Med Chem Lett 17: 2899-903 (2007)
Article DOI: 10.1016/j.bmcl.2007.02.049
BindingDB Entry DOI: 10.7270/Q2K64GBR
Procathepsin L
(Homo sapiens (Human))
BDBM19656
((2R)-2-(2-cyclopentylethyl)-4-(morpholin-4-yl)-4-o...)
Show SMILES FC(F)(F)Oc1ccc(NC[C@H](CCc2ccccc2)NC(=O)[C@H](CCC2CCCC2)CC(=O)N2CCOCC2)cc1 |r|
Show InChI InChI=1S/C32H42F3N3O4/c33-32(34,35)42-29-16-14-27(15-17-29)36-23-28(13-11-25-6-2-1-3-7-25)37-31(40)26(12-10-24-8-4-5-9-24)22-30(39)38-18-20-41-21-19-38/h1-3,6-7,14-17,24,26,28,36H,4-5,8-13,18-23H2,(H,37,40)/t26-,28+/m1/s1
Reactome pathway
2.31E+3n/an/an/an/an/an/an/an/a
GNF
Assay Description
The recombinant human cathepsin enzyme was preincubated with inhibitor for 20 minutes prior to addition of substrate. The substrate hydrolysis was mo...
Bioorg Med Chem Lett 17: 2899-903 (2007)
Article DOI: 10.1016/j.bmcl.2007.02.049
BindingDB Entry DOI: 10.7270/Q2K64GBR
Cathepsin K
(Homo sapiens (Human))
BDBM19656
((2R)-2-(2-cyclopentylethyl)-4-(morpholin-4-yl)-4-o...)
Show SMILES FC(F)(F)Oc1ccc(NC[C@H](CCc2ccccc2)NC(=O)[C@H](CCC2CCCC2)CC(=O)N2CCOCC2)cc1 |r|
Show InChI InChI=1S/C32H42F3N3O4/c33-32(34,35)42-29-16-14-27(15-17-29)36-23-28(13-11-25-6-2-1-3-7-25)37-31(40)26(12-10-24-8-4-5-9-24)22-30(39)38-18-20-41-21-19-38/h1-3,6-7,14-17,24,26,28,36H,4-5,8-13,18-23H2,(H,37,40)/t26-,28+/m1/s1
Reactome pathway
>3.00E+4n/an/an/an/an/an/an/an/a
GNF
Assay Description
The recombinant human cathepsin enzyme was preincubated with inhibitor for 20 minutes prior to addition of substrate. The substrate hydrolysis was mo...
Bioorg Med Chem Lett 17: 2899-903 (2007)
Article DOI: 10.1016/j.bmcl.2007.02.049
BindingDB Entry DOI: 10.7270/Q2K64GBR