BDBM19679 (2S)-3-cyclohexyl-1-(morpholin-4-yl)-1-oxopropan-2-yl N-[(2R)-1-(benzyloxy)-3-(5-fluoro-2,3-dihydro-1H-indol-1-yl)propan-2-yl]carbamate::Arylaminoethyl carbamate, 10
SMILES: Fc1ccc2N(C[C@H](COCc3ccccc3)NC(=O)O[C@@H](CC3CCCCC3)C(=O)N3CCOCC3)CCc2c1
InChI Key: InChIKey=YVNKVURFOBPKHU-DGPALRBDSA-N
Data: 3 KI
Activity Spreadsheet -- Enzyme Inhibition Constant Data from BindingDB
Found 3 hits for monomerid = 19679
Trg + Lig
Ki
nM
ΔG°
kcal/mole
IC50
nM
Kd
nM
EC50/IC50
nM
koff
s-1
kon
M-1s-1
pHTemp
°C
Cathepsin S
(Homo sapiens (Human))
BDBM19679
((2S)-3-cyclohexyl-1-(morpholin-4-yl)-1-oxopropan-2...)
Show SMILES Fc1ccc2N(C[C@H](COCc3ccccc3)NC(=O)O[C@@H](CC3CCCCC3)C(=O)N3CCOCC3)CCc2c1 |r|
Show InChI InChI=1S/C32H42FN3O5/c33-27-11-12-29-26(20-27)13-14-36(29)21-28(23-40-22-25-9-5-2-6-10-25)34-32(38)41-30(19-24-7-3-1-4-8-24)31(37)35-15-17-39-18-16-35/h2,5-6,9-12,20,24,28,30H,1,3-4,7-8,13-19,21-23H2,(H,34,38)/t28-,30+/m1/s1
Reactome pathway
8 -11.5n/an/an/an/an/a5.537
GNF
Assay Description
The recombinant human cathepsin enzyme was preincubated with inhibitor for 20 minutes prior to addition of substrate. The substrate hydrolysis was mo...
Bioorg Med Chem Lett 16: 5107-11 (2006)
Article DOI: 10.1016/j.bmcl.2006.07.032
BindingDB Entry DOI: 10.7270/Q2FF3QM1
Cathepsin K
(Homo sapiens (Human))
BDBM19679
((2S)-3-cyclohexyl-1-(morpholin-4-yl)-1-oxopropan-2...)
Show SMILES Fc1ccc2N(C[C@H](COCc3ccccc3)NC(=O)O[C@@H](CC3CCCCC3)C(=O)N3CCOCC3)CCc2c1 |r|
Show InChI InChI=1S/C32H42FN3O5/c33-27-11-12-29-26(20-27)13-14-36(29)21-28(23-40-22-25-9-5-2-6-10-25)34-32(38)41-30(19-24-7-3-1-4-8-24)31(37)35-15-17-39-18-16-35/h2,5-6,9-12,20,24,28,30H,1,3-4,7-8,13-19,21-23H2,(H,34,38)/t28-,30+/m1/s1
Reactome pathway
8.71E+3n/an/an/an/an/an/an/an/a
GNF
Assay Description
The recombinant human cathepsin enzyme was preincubated with inhibitor for 20 minutes prior to addition of substrate. The substrate hydrolysis was mo...
Bioorg Med Chem Lett 16: 5107-11 (2006)
Article DOI: 10.1016/j.bmcl.2006.07.032
BindingDB Entry DOI: 10.7270/Q2FF3QM1
Procathepsin L
(Homo sapiens (Human))
BDBM19679
((2S)-3-cyclohexyl-1-(morpholin-4-yl)-1-oxopropan-2...)
Show SMILES Fc1ccc2N(C[C@H](COCc3ccccc3)NC(=O)O[C@@H](CC3CCCCC3)C(=O)N3CCOCC3)CCc2c1 |r|
Show InChI InChI=1S/C32H42FN3O5/c33-27-11-12-29-26(20-27)13-14-36(29)21-28(23-40-22-25-9-5-2-6-10-25)34-32(38)41-30(19-24-7-3-1-4-8-24)31(37)35-15-17-39-18-16-35/h2,5-6,9-12,20,24,28,30H,1,3-4,7-8,13-19,21-23H2,(H,34,38)/t28-,30+/m1/s1
Reactome pathway
1.77E+4n/an/an/an/an/an/an/an/a
GNF
Assay Description
The recombinant human cathepsin enzyme was preincubated with inhibitor for 20 minutes prior to addition of substrate. The substrate hydrolysis was mo...
Bioorg Med Chem Lett 16: 5107-11 (2006)
Article DOI: 10.1016/j.bmcl.2006.07.032
BindingDB Entry DOI: 10.7270/Q2FF3QM1