null
SMILES: NC(=O)c1c(Nc2ccc(N3CCNCC3)c(Cl)c2)nc(Cc2c(Cl)cccc2Cl)c2nc[nH]c12
InChI Key: InChIKey=BVPXPPFYICCMLK-UHFFFAOYSA-N
Activity Spreadsheet -- Enzyme Inhibition Constant Data from BindingDB
Found 1 hit for monomerid = 196855
Trg + Lig
Ki
nM
ΔG°
kcal/mole
IC50
nM
Kd
nM
EC50/IC50
nM
koff
s-1
kon
M-1s-1
pHTemp
°C
ALK tyrosine kinase receptor
(Homo sapiens (Human))
BDBM196855
(US9212192, 18)
Show SMILES NC(=O)c1c(Nc2ccc(N3CCNCC3)c(Cl)c2)nc(Cc2c(Cl)cccc2Cl)c2nc[nH]c12
Show InChI InChI=1S/C24H22Cl3N7O/c25-15-2-1-3-16(26)14(15)11-18-21-22(31-12-30-21)20(23(28)35)24(33-18)32-13-4-5-19(17(27)10-13)34-8-6-29-7-9-34/h1-5,10,12,29H,6-9,11H2,(H2,28,35)(H,30,31)(H,32,33)
US Patent
<1<-12.3n/an/an/an/an/a7.425
AbbVie Inc.
US Patent
Assay Description
ALK kinase assays were conducted with the indicated final concentrations unless otherwise specified. In 384 well black plates (Axygen), 8 ul of compo...
US Patent US9212192 (2015)
BindingDB Entry DOI: 10.7270/Q2D79971