BDBM196911 US9212196, Derivative 7
SMILES: COc1cc(cc(Cl)c1OCC(O)=O)C(O)P(O)(=O)CC[C@@H](N)C(O)=O
InChI Key: InChIKey=CITKLHPQBXWCKK-UCWRFOARSA-N
Data: 3 EC50
Activity Spreadsheet -- Enzyme Inhibition Constant Data from BindingDB
Found 3 hits for monomerid = 196911
Trg + Lig
Ki
nM
ΔG°
kcal/mole
IC50
nM
Kd
nM
EC50/IC50
nM
koff
s-1
kon
M-1s-1
pHTemp
°C
Metabotropic glutamate receptor 4 (mGlu4)
(Rattus norvegicus (Rat))
BDBM196911
(US9212196, Derivative 7)
Show SMILES COc1cc(cc(Cl)c1OCC(O)=O)C(O)P(O)(=O)CC[C@@H](N)C(O)=O |r|
Show InChI InChI=1S/C14H19ClNO9P/c1-24-10-5-7(4-8(15)12(10)25-6-11(17)18)14(21)26(22,23)3-2-9(16)13(19)20/h4-5,9,14,21H,2-3,6,16H2,1H3,(H,17,18)(H,19,20)(H,22,23)/t9-,14?/m1/s1
US Patent
n/an/an/an/a 130n/an/an/an/a
UNIVERSITE PARIS DESCARTES; UNIVERSITE D'AUVERGNE
US Patent
Assay Description
Metabotropic glutamate receptors were transiently transfected in HEK293 cells by electroporation as described elsewhere (Brabet I. et al., 1998) and ...
US Patent US9212196 (2015)
BindingDB Entry DOI: 10.7270/Q28G8JJR
Metabotropic glutamate receptor 7 (mGlu7)
(Rattus norvegicus (Rat))
BDBM196911
(US9212196, Derivative 7)
Show SMILES COc1cc(cc(Cl)c1OCC(O)=O)C(O)P(O)(=O)CC[C@@H](N)C(O)=O |r|
Show InChI InChI=1S/C14H19ClNO9P/c1-24-10-5-7(4-8(15)12(10)25-6-11(17)18)14(21)26(22,23)3-2-9(16)13(19)20/h4-5,9,14,21H,2-3,6,16H2,1H3,(H,17,18)(H,19,20)(H,22,23)/t9-,14?/m1/s1
US Patent
n/an/an/an/a 1.14E+4n/an/an/an/a
UNIVERSITE PARIS DESCARTES; UNIVERSITE D'AUVERGNE
US Patent
Assay Description
Metabotropic glutamate receptors were transiently transfected in HEK293 cells by electroporation as described elsewhere (Brabet I. et al., 1998) and ...
US Patent US9212196 (2015)
BindingDB Entry DOI: 10.7270/Q28G8JJR
Metabotropic glutamate receptor 8 (mGlu8)
(Rattus norvegicus (Rat))
BDBM196911
(US9212196, Derivative 7)
Show SMILES COc1cc(cc(Cl)c1OCC(O)=O)C(O)P(O)(=O)CC[C@@H](N)C(O)=O |r|
Show InChI InChI=1S/C14H19ClNO9P/c1-24-10-5-7(4-8(15)12(10)25-6-11(17)18)14(21)26(22,23)3-2-9(16)13(19)20/h4-5,9,14,21H,2-3,6,16H2,1H3,(H,17,18)(H,19,20)(H,22,23)/t9-,14?/m1/s1
US Patent
n/an/an/an/a 4.40E+4n/an/an/an/a
UNIVERSITE PARIS DESCARTES; UNIVERSITE D'AUVERGNE
US Patent
Assay Description
Metabotropic glutamate receptors were transiently transfected in HEK293 cells by electroporation as described elsewhere (Brabet I. et al., 1998) and ...
US Patent US9212196 (2015)
BindingDB Entry DOI: 10.7270/Q28G8JJR