BDBM196981 US9206164, 45
SMILES: CCc1nn(Cc2ccc(cc2)-c2nc3cc(Cl)ccc3[nH]2)c(CC)c1CC(O)=O
InChI Key: InChIKey=SJMPMSJGLXCAEZ-UHFFFAOYSA-N
Data: 1 KI
Activity Spreadsheet -- Enzyme Inhibition Constant Data from BindingDB
Found 1 hit for monomerid = 196981
Trg + Lig
Ki
nM
ΔG°
kcal/mole
IC50
nM
Kd
nM
EC50/IC50
nM
koff
s-1
kon
M-1s-1
pHTemp
°C
G protein-coupled receptor 44
(Homo sapiens (Human))
BDBM196981
(US9206164, 45)
Show SMILES CCc1nn(Cc2ccc(cc2)-c2nc3cc(Cl)ccc3[nH]2)c(CC)c1CC(O)=O
Show InChI InChI=1S/C23H23ClN4O2/c1-3-18-17(12-22(29)30)21(4-2)28(27-18)13-14-5-7-15(8-6-14)23-25-19-10-9-16(24)11-20(19)26-23/h5-11H,3-4,12-13H2,1-2H3,(H,25,26)(H,29,30)
Reactome pathway
US Patent
0.300n/an/an/an/an/an/a7.4n/a
Boehringer Ingelheim International GmbH
US Patent
Assay Description
The CRTH2 receptor binding assay is performed in a scintillation proximity assay (SPA) format with the radioligand [3H]-PGD2 (Perkin Elmer, NET616000...
US Patent US9206164 (2015)
BindingDB Entry DOI: 10.7270/Q2PR7TS9