BDBM196993 US9206164, 57
SMILES: CCc1nn(Cc2ccc(cc2)-c2nc3cc(Br)cnc3[nH]2)c(CC)c1CC(O)=O
InChI Key: InChIKey=WWSUJHOVRWZTOT-UHFFFAOYSA-N
Data: 1 KI
Activity Spreadsheet -- Enzyme Inhibition Constant Data from BindingDB
Found 1 hit for monomerid = 196993
Trg + Lig
Ki
nM
ΔG°
kcal/mole
IC50
nM
Kd
nM
EC50/IC50
nM
koff
s-1
kon
M-1s-1
pHTemp
°C
G protein-coupled receptor 44
(Homo sapiens (Human))
BDBM196993
(US9206164, 57)
Show SMILES CCc1nn(Cc2ccc(cc2)-c2nc3cc(Br)cnc3[nH]2)c(CC)c1CC(O)=O
Show InChI InChI=1S/C22H22BrN5O2/c1-3-17-16(10-20(29)30)19(4-2)28(27-17)12-13-5-7-14(8-6-13)21-25-18-9-15(23)11-24-22(18)26-21/h5-9,11H,3-4,10,12H2,1-2H3,(H,29,30)(H,24,25,26)
Reactome pathway
US Patent
1.5n/an/an/an/an/an/a7.4n/a
Boehringer Ingelheim International GmbH
US Patent
Assay Description
The CRTH2 receptor binding assay is performed in a scintillation proximity assay (SPA) format with the radioligand [3H]-PGD2 (Perkin Elmer, NET616000...
US Patent US9206164 (2015)
BindingDB Entry DOI: 10.7270/Q2PR7TS9