BDBM196994 US9206164, 58
SMILES: CCc1nn(Cc2ccc(cc2)-c2nc3cc(C)ccc3[nH]2)c(CC)c1CC(O)=O
InChI Key: InChIKey=FRAJDNDXWZJDCB-UHFFFAOYSA-N
Data: 1 KI
Activity Spreadsheet -- Enzyme Inhibition Constant Data from BindingDB
Found 1 hit for monomerid = 196994
Trg + Lig
Ki
nM
ΔG°
kcal/mole
IC50
nM
Kd
nM
EC50/IC50
nM
koff
s-1
kon
M-1s-1
pHTemp
°C
Prostaglandin D2 receptor 2
(Homo sapiens (Human))
BDBM196994
(US9206164, 58)
Show SMILES CCc1nn(Cc2ccc(cc2)-c2nc3cc(C)ccc3[nH]2)c(CC)c1CC(O)=O
Show InChI InChI=1S/C24H26N4O2/c1-4-19-18(13-23(29)30)22(5-2)28(27-19)14-16-7-9-17(10-8-16)24-25-20-11-6-15(3)12-21(20)26-24/h6-12H,4-5,13-14H2,1-3H3,(H,25,26)(H,29,30)
Reactome pathway
US Patent
1.30n/an/an/an/an/an/a7.4n/a
Boehringer Ingelheim International GmbH
US Patent
Assay Description
The CRTH2 receptor binding assay is performed in a scintillation proximity assay (SPA) format with the radioligand [3H]-PGD2 (Perkin Elmer, NET616000...
US Patent US9206164 (2015)
BindingDB Entry DOI: 10.7270/Q2PR7TS9