null
SMILES: Cc1nn(Cc2ccc(cc2)-c2nc3c(Cl)cc(Cl)cc3[nH]2)c(C)c1CC(O)=O
InChI Key: InChIKey=ALFWSWHZSAVRAP-UHFFFAOYSA-N
Activity Spreadsheet -- Enzyme Inhibition Constant Data from BindingDB
Found 1 hit for monomerid = 197002
Trg + Lig
Ki
nM
ΔG°
kcal/mole
IC50
nM
Kd
nM
EC50/IC50
nM
koff
s-1
kon
M-1s-1
pHTemp
°C
Prostaglandin D2 receptor 2
(Homo sapiens (Human))
BDBM197002
(US9206164, 66)
Show SMILES Cc1nn(Cc2ccc(cc2)-c2nc3c(Cl)cc(Cl)cc3[nH]2)c(C)c1CC(O)=O
Show InChI InChI=1S/C21H18Cl2N4O2/c1-11-16(9-19(28)29)12(2)27(26-11)10-13-3-5-14(6-4-13)21-24-18-8-15(22)7-17(23)20(18)25-21/h3-8H,9-10H2,1-2H3,(H,24,25)(H,28,29)
Reactome pathway
US Patent
1n/an/an/an/an/an/a7.4n/a
Boehringer Ingelheim International GmbH
US Patent
Assay Description
The CRTH2 receptor binding assay is performed in a scintillation proximity assay (SPA) format with the radioligand [3H]-PGD2 (Perkin Elmer, NET616000...
US Patent US9206164 (2015)
BindingDB Entry DOI: 10.7270/Q2PR7TS9