null
SMILES: CC(C)C[C@H](S)C(=O)N1CCC[C@H]1C(=O)N1CCC[C@H]1C(=O)N(C)[C@@H](C)C(O)=O
InChI Key: InChIKey=GODDKMSRPVPPPQ-VGWMRTNUSA-N
Activity Spreadsheet -- Enzyme Inhibition Constant Data from BindingDB
Found 2 hits for monomerid = 197054
Trg + Lig
Ki
nM
ΔG°
kcal/mole
IC50
nM
Kd
nM
EC50/IC50
nM
koff
s-1
kon
M-1s-1
pHTemp
°C
Angiotensin-converting enzyme
(Homo sapiens (Human))
BDBM197054
(US9212206, VII)
Show SMILES CC(C)C[C@H](S)C(=O)N1CCC[C@H]1C(=O)N1CCC[C@H]1C(=O)N(C)[C@@H](C)C(O)=O |r|
Show InChI InChI=1S/C20H33N3O5S/c1-12(2)11-16(29)19(26)23-10-6-8-15(23)18(25)22-9-5-7-14(22)17(24)21(4)13(3)20(27)28/h12-16,29H,5-11H2,1-4H3,(H,27,28)/t13-,14-,15-,16-/m0/s1
Reactome pathway
US Patent
n/an/a 640n/an/an/an/a7.4n/a
TBA
US Patent
Assay Description
Human recombinant angiotensin-converting enzyme (hrACE) was obtained from R&D Systems (Minneapolis, Minn.). Its enzyme activity was determined using ...
US Patent US9212206 (2015)
BindingDB Entry DOI: 10.7270/Q24T6H5V
Xaa-Pro aminopeptidase 2
(Homo sapiens (Human))
BDBM197054
(US9212206, VII)
Show SMILES CC(C)C[C@H](S)C(=O)N1CCC[C@H]1C(=O)N1CCC[C@H]1C(=O)N(C)[C@@H](C)C(O)=O |r|
Show InChI InChI=1S/C20H33N3O5S/c1-12(2)11-16(29)19(26)23-10-6-8-15(23)18(25)22-9-5-7-14(22)17(24)21(4)13(3)20(27)28/h12-16,29H,5-11H2,1-4H3,(H,27,28)/t13-,14-,15-,16-/m0/s1
US Patent
n/an/a 3.90n/an/an/an/a7.4n/a
TBA
US Patent
Assay Description
Human aminopeptidase P2 (APP2) enzyme activity was determined using the internally quenched fluorescent substrate: H-Lys(2-aminobenzoyl)-Pro-Pro-p-ni...
US Patent US9212206 (2015)
BindingDB Entry DOI: 10.7270/Q24T6H5V