BDBM19712 (2S)-3-cyclohexyl-2-(oxan-4-ylformamido)-N-[(2S)-1-{[4-(trifluoromethoxy)phenyl]amino}propan-2-yl]propanamide::arylaminoethyl amide deriv. 26
SMILES: C[C@@H](CNc1ccc(OC(F)(F)F)cc1)NC(=O)[C@H](CC1CCCCC1)NC(=O)C1CCOCC1
InChI Key: InChIKey=JBUDNBVFEGSCNW-JTSKRJEESA-N
Data: 3 KI
Activity Spreadsheet -- Enzyme Inhibition Constant Data from BindingDB
Found 3 hits for monomerid = 19712
Trg + Lig
Ki
nM
ΔG°
kcal/mole
IC50
nM
Kd
nM
EC50/IC50
nM
koff
s-1
kon
M-1s-1
pHTemp
°C
Cathepsin S
(Homo sapiens (Human))
BDBM19712
((2S)-3-cyclohexyl-2-(oxan-4-ylformamido)-N-[(2S)-1...)
Show SMILES C[C@@H](CNc1ccc(OC(F)(F)F)cc1)NC(=O)[C@H](CC1CCCCC1)NC(=O)C1CCOCC1 |r|
Show InChI InChI=1S/C25H36F3N3O4/c1-17(16-29-20-7-9-21(10-8-20)35-25(26,27)28)30-24(33)22(15-18-5-3-2-4-6-18)31-23(32)19-11-13-34-14-12-19/h7-10,17-19,22,29H,2-6,11-16H2,1H3,(H,30,33)(H,31,32)/t17-,22-/m0/s1
Reactome pathway
12 -11.2n/an/an/an/an/a5.537
GNF
Assay Description
The recombinant human cathepsin enzyme was preincubated with inhibitor for 20 minutes prior to addition of substrate. The substrate hydrolysis was mo...
Bioorg Med Chem Lett 16: 5112-7 (2006)
Article DOI: 10.1016/j.bmcl.2006.07.033
BindingDB Entry DOI: 10.7270/Q29P2ZXR
Procathepsin L
(Homo sapiens (Human))
BDBM19712
((2S)-3-cyclohexyl-2-(oxan-4-ylformamido)-N-[(2S)-1...)
Show SMILES C[C@@H](CNc1ccc(OC(F)(F)F)cc1)NC(=O)[C@H](CC1CCCCC1)NC(=O)C1CCOCC1 |r|
Show InChI InChI=1S/C25H36F3N3O4/c1-17(16-29-20-7-9-21(10-8-20)35-25(26,27)28)30-24(33)22(15-18-5-3-2-4-6-18)31-23(32)19-11-13-34-14-12-19/h7-10,17-19,22,29H,2-6,11-16H2,1H3,(H,30,33)(H,31,32)/t17-,22-/m0/s1
Reactome pathway
232n/an/an/an/an/an/an/an/a
GNF
Assay Description
The recombinant human cathepsin enzyme was preincubated with inhibitor for 20 minutes prior to addition of substrate. The substrate hydrolysis was mo...
Bioorg Med Chem Lett 16: 5112-7 (2006)
Article DOI: 10.1016/j.bmcl.2006.07.033
BindingDB Entry DOI: 10.7270/Q29P2ZXR
Cathepsin K
(Homo sapiens (Human))
BDBM19712
((2S)-3-cyclohexyl-2-(oxan-4-ylformamido)-N-[(2S)-1...)
Show SMILES C[C@@H](CNc1ccc(OC(F)(F)F)cc1)NC(=O)[C@H](CC1CCCCC1)NC(=O)C1CCOCC1 |r|
Show InChI InChI=1S/C25H36F3N3O4/c1-17(16-29-20-7-9-21(10-8-20)35-25(26,27)28)30-24(33)22(15-18-5-3-2-4-6-18)31-23(32)19-11-13-34-14-12-19/h7-10,17-19,22,29H,2-6,11-16H2,1H3,(H,30,33)(H,31,32)/t17-,22-/m0/s1
Reactome pathway
1.43E+4n/an/an/an/an/an/an/an/a
GNF
Assay Description
The recombinant human cathepsin enzyme was preincubated with inhibitor for 20 minutes prior to addition of substrate. The substrate hydrolysis was mo...
Bioorg Med Chem Lett 16: 5112-7 (2006)
Article DOI: 10.1016/j.bmcl.2006.07.033
BindingDB Entry DOI: 10.7270/Q29P2ZXR