BDBM19713 arylaminoethyl amide deriv. 27::oxan-4-yl N-[(1S)-2-cyclohexyl-1-{[(2S)-1-{[4-(trifluoromethoxy)phenyl]amino}propan-2-yl]carbamoyl}ethyl]carbamate
SMILES: C[C@@H](CNc1ccc(OC(F)(F)F)cc1)NC(=O)[C@H](CC1CCCCC1)NC(=O)OC1CCOCC1
InChI Key: InChIKey=NIYLYMJVTONMDJ-JTSKRJEESA-N
Data: 3 KI
Activity Spreadsheet -- Enzyme Inhibition Constant Data from BindingDB
Found 3 hits for monomerid = 19713
Trg + Lig
Ki
nM
ΔG°
kcal/mole
IC50
nM
Kd
nM
EC50/IC50
nM
koff
s-1
kon
M-1s-1
pHTemp
°C
Cathepsin S
(Homo sapiens (Human))
BDBM19713
(arylaminoethyl amide deriv. 27 | oxan-4-yl N-[(1S)...)
Show SMILES C[C@@H](CNc1ccc(OC(F)(F)F)cc1)NC(=O)[C@H](CC1CCCCC1)NC(=O)OC1CCOCC1 |r|
Show InChI InChI=1S/C25H36F3N3O5/c1-17(16-29-19-7-9-21(10-8-19)36-25(26,27)28)30-23(32)22(15-18-5-3-2-4-6-18)31-24(33)35-20-11-13-34-14-12-20/h7-10,17-18,20,22,29H,2-6,11-16H2,1H3,(H,30,32)(H,31,33)/t17-,22-/m0/s1
Reactome pathway
12 -11.2n/an/an/an/an/a5.537
GNF
Assay Description
The recombinant human cathepsin enzyme was preincubated with inhibitor for 20 minutes prior to addition of substrate. The substrate hydrolysis was mo...
Bioorg Med Chem Lett 16: 5112-7 (2006)
Article DOI: 10.1016/j.bmcl.2006.07.033
BindingDB Entry DOI: 10.7270/Q29P2ZXR
Procathepsin L
(Homo sapiens (Human))
BDBM19713
(arylaminoethyl amide deriv. 27 | oxan-4-yl N-[(1S)...)
Show SMILES C[C@@H](CNc1ccc(OC(F)(F)F)cc1)NC(=O)[C@H](CC1CCCCC1)NC(=O)OC1CCOCC1 |r|
Show InChI InChI=1S/C25H36F3N3O5/c1-17(16-29-19-7-9-21(10-8-19)36-25(26,27)28)30-23(32)22(15-18-5-3-2-4-6-18)31-24(33)35-20-11-13-34-14-12-20/h7-10,17-18,20,22,29H,2-6,11-16H2,1H3,(H,30,32)(H,31,33)/t17-,22-/m0/s1
Reactome pathway
75n/an/an/an/an/an/an/an/a
GNF
Assay Description
The recombinant human cathepsin enzyme was preincubated with inhibitor for 20 minutes prior to addition of substrate. The substrate hydrolysis was mo...
Bioorg Med Chem Lett 16: 5112-7 (2006)
Article DOI: 10.1016/j.bmcl.2006.07.033
BindingDB Entry DOI: 10.7270/Q29P2ZXR
Cathepsin K
(Homo sapiens (Human))
BDBM19713
(arylaminoethyl amide deriv. 27 | oxan-4-yl N-[(1S)...)
Show SMILES C[C@@H](CNc1ccc(OC(F)(F)F)cc1)NC(=O)[C@H](CC1CCCCC1)NC(=O)OC1CCOCC1 |r|
Show InChI InChI=1S/C25H36F3N3O5/c1-17(16-29-19-7-9-21(10-8-19)36-25(26,27)28)30-23(32)22(15-18-5-3-2-4-6-18)31-24(33)35-20-11-13-34-14-12-20/h7-10,17-18,20,22,29H,2-6,11-16H2,1H3,(H,30,32)(H,31,33)/t17-,22-/m0/s1
Reactome pathway
1.33E+4n/an/an/an/an/an/an/an/a
GNF
Assay Description
The recombinant human cathepsin enzyme was preincubated with inhibitor for 20 minutes prior to addition of substrate. The substrate hydrolysis was mo...
Bioorg Med Chem Lett 16: 5112-7 (2006)
Article DOI: 10.1016/j.bmcl.2006.07.033
BindingDB Entry DOI: 10.7270/Q29P2ZXR