null
SMILES: C[C@@H](CNc1ccc(OC(F)(F)F)cc1)NC(=O)[C@H](CSCc1ccccc1)NC(=O)N1CCOCC1
InChI Key: InChIKey=RFIOGZCCMRDOHV-AVRDEDQJSA-N
PDB links: 2 PDB IDs contain this monomer as substructures. 2 PDB IDs contain inhibitors having a similarity of 90% to this monomer.
Activity Spreadsheet -- Enzyme Inhibition Constant Data from BindingDB
Found 3 hits for monomerid = 19722
Trg + Lig
Ki
nM
ΔG°
kcal/mole
IC50
nM
Kd
nM
EC50/IC50
nM
koff
s-1
kon
M-1s-1
pHTemp
°C
Cathepsin S
(Homo sapiens (Human))
BDBM19722
((2R)-3-(benzylsulfanyl)-2-(morpholin-4-ylcarbonyla...)
Show SMILES C[C@@H](CNc1ccc(OC(F)(F)F)cc1)NC(=O)[C@H](CSCc1ccccc1)NC(=O)N1CCOCC1 |r|
Show InChI InChI=1S/C25H31F3N4O4S/c1-18(15-29-20-7-9-21(10-8-20)36-25(26,27)28)30-23(33)22(17-37-16-19-5-3-2-4-6-19)31-24(34)32-11-13-35-14-12-32/h2-10,18,22,29H,11-17H2,1H3,(H,30,33)(H,31,34)/t18-,22-/m0/s1
Reactome pathway
12 -11.2n/an/an/an/an/a5.537
GNF
Assay Description
The recombinant human cathepsin enzyme was preincubated with inhibitor for 20 minutes prior to addition of substrate. The substrate hydrolysis was mo...
Bioorg Med Chem Lett 16: 5112-7 (2006)
Article DOI: 10.1016/j.bmcl.2006.07.033
BindingDB Entry DOI: 10.7270/Q29P2ZXR
Procathepsin L
(Homo sapiens (Human))
BDBM19722
((2R)-3-(benzylsulfanyl)-2-(morpholin-4-ylcarbonyla...)
Show SMILES C[C@@H](CNc1ccc(OC(F)(F)F)cc1)NC(=O)[C@H](CSCc1ccccc1)NC(=O)N1CCOCC1 |r|
Show InChI InChI=1S/C25H31F3N4O4S/c1-18(15-29-20-7-9-21(10-8-20)36-25(26,27)28)30-23(33)22(17-37-16-19-5-3-2-4-6-19)31-24(34)32-11-13-35-14-12-32/h2-10,18,22,29H,11-17H2,1H3,(H,30,33)(H,31,34)/t18-,22-/m0/s1
Reactome pathway
1.18E+3n/an/an/an/an/an/an/an/a
GNF
Assay Description
The recombinant human cathepsin enzyme was preincubated with inhibitor for 20 minutes prior to addition of substrate. The substrate hydrolysis was mo...
Bioorg Med Chem Lett 16: 5112-7 (2006)
Article DOI: 10.1016/j.bmcl.2006.07.033
BindingDB Entry DOI: 10.7270/Q29P2ZXR
Cathepsin K
(Homo sapiens (Human))
BDBM19722
((2R)-3-(benzylsulfanyl)-2-(morpholin-4-ylcarbonyla...)
Show SMILES C[C@@H](CNc1ccc(OC(F)(F)F)cc1)NC(=O)[C@H](CSCc1ccccc1)NC(=O)N1CCOCC1 |r|
Show InChI InChI=1S/C25H31F3N4O4S/c1-18(15-29-20-7-9-21(10-8-20)36-25(26,27)28)30-23(33)22(17-37-16-19-5-3-2-4-6-19)31-24(34)32-11-13-35-14-12-32/h2-10,18,22,29H,11-17H2,1H3,(H,30,33)(H,31,34)/t18-,22-/m0/s1
Reactome pathway
2.48E+3n/an/an/an/an/an/an/an/a
GNF
Assay Description
The recombinant human cathepsin enzyme was preincubated with inhibitor for 20 minutes prior to addition of substrate. The substrate hydrolysis was mo...
Bioorg Med Chem Lett 16: 5112-7 (2006)
Article DOI: 10.1016/j.bmcl.2006.07.033
BindingDB Entry DOI: 10.7270/Q29P2ZXR