BDBM19768 Cbz-Leu-NH-CH2-CN::JMC487688 Compound 8::benzyl N-[(1S)-1-[(cyanomethyl)carbamoyl]-3-methylbutyl]carbamate::dipeptidyl nitrile, 1
SMILES: CC(C)C[C@H](NC(=O)OCc1ccccc1)C(=O)NCC#N
InChI Key: InChIKey=UFXQLUZNMRVTPU-AWEZNQCLSA-N
Data: 6 KI  1 IC50
Activity Spreadsheet -- Enzyme Inhibition Constant Data from BindingDB
Found 7 hits for monomerid = 19768
Trg + Lig
Ki
nM
ΔG°
kcal/mole
IC50
nM
Kd
nM
EC50/IC50
nM
koff
s-1
kon
M-1s-1
pHTemp
°C
Cathepsin K
(Oryctolagus cuniculus (rabbit))
BDBM19768
(Cbz-Leu-NH-CH2-CN | JMC487688 Compound 8 | benzyl ...)
Show SMILES CC(C)C[C@H](NC(=O)OCc1ccccc1)C(=O)NCC#N |r|
Show InChI InChI=1S/C16H21N3O3/c1-12(2)10-14(15(20)18-9-8-17)19-16(21)22-11-13-6-4-3-5-7-13/h3-7,12,14H,9-11H2,1-2H3,(H,18,20)(H,19,21)/t14-/m0/s1
34.7n/an/an/an/an/an/an/an/a
Celera Genomics, Inc.
Curated by ChEMBL
Assay Description
Inhibitory constant against rabbit cathepsin K using Z-Phe-Arg-AMC substrate
J Med Chem 48: 7520-34 (2005)
Article DOI: 10.1021/jm058198r
BindingDB Entry DOI: 10.7270/Q23T9GSB
Cathepsin K
(Homo sapiens (Human))
BDBM19768
(Cbz-Leu-NH-CH2-CN | JMC487688 Compound 8 | benzyl ...)
Show SMILES CC(C)C[C@H](NC(=O)OCc1ccccc1)C(=O)NCC#N |r|
Show InChI InChI=1S/C16H21N3O3/c1-12(2)10-14(15(20)18-9-8-17)19-16(21)22-11-13-6-4-3-5-7-13/h3-7,12,14H,9-11H2,1-2H3,(H,18,20)(H,19,21)/t14-/m0/s1
Reactome pathway
35n/an/an/an/an/an/an/an/a
Rheinische Friedrich-Wilhelms-Universitat Bonn
Assay Description
Enzyme activities were calculated from kinetic measurements performed by fluorimetric detection of the product AMC at the wavelengths for excitation ...
J Med Chem 48: 7688-707 (2005)
Article DOI: 10.1021/jm050686b
BindingDB Entry DOI: 10.7270/Q2GB22BG
Cathepsin S
(Homo sapiens (Human))
BDBM19768
(Cbz-Leu-NH-CH2-CN | JMC487688 Compound 8 | benzyl ...)
Show SMILES CC(C)C[C@H](NC(=O)OCc1ccccc1)C(=O)NCC#N |r|
Show InChI InChI=1S/C16H21N3O3/c1-12(2)10-14(15(20)18-9-8-17)19-16(21)22-11-13-6-4-3-5-7-13/h3-7,12,14H,9-11H2,1-2H3,(H,18,20)(H,19,21)/t14-/m0/s1
Reactome pathway
130n/an/an/an/an/an/an/an/a
Rheinische Friedrich-Wilhelms-Universitat Bonn
Assay Description
Enzyme activities were calculated from kinetic measurements performed by fluorimetric detection of the product AMC at the wavelengths for excitation ...
J Med Chem 48: 7688-707 (2005)
Article DOI: 10.1021/jm050686b
BindingDB Entry DOI: 10.7270/Q2GB22BG
Cathepsin L
(Bos taurus (bovine))
BDBM19768
(Cbz-Leu-NH-CH2-CN | JMC487688 Compound 8 | benzyl ...)
Show SMILES CC(C)C[C@H](NC(=O)OCc1ccccc1)C(=O)NCC#N |r|
Show InChI InChI=1S/C16H21N3O3/c1-12(2)10-14(15(20)18-9-8-17)19-16(21)22-11-13-6-4-3-5-7-13/h3-7,12,14H,9-11H2,1-2H3,(H,18,20)(H,19,21)/t14-/m0/s1
Reactome pathway
750n/an/an/an/an/an/an/an/a
Rheinische Friedrich-Wilhelms-Universitat Bonn
Assay Description
Enzyme activities were calculated from kinetic measurements performed by fluorimetric detection of the product AMC at the wavelengths for excitation ...
J Med Chem 48: 7688-707 (2005)
Article DOI: 10.1021/jm050686b
BindingDB Entry DOI: 10.7270/Q2GB22BG
Papain
(Carica papaya)
BDBM19768
(Cbz-Leu-NH-CH2-CN | JMC487688 Compound 8 | benzyl ...)
Show SMILES CC(C)C[C@H](NC(=O)OCc1ccccc1)C(=O)NCC#N |r|
Show InChI InChI=1S/C16H21N3O3/c1-12(2)10-14(15(20)18-9-8-17)19-16(21)22-11-13-6-4-3-5-7-13/h3-7,12,14H,9-11H2,1-2H3,(H,18,20)(H,19,21)/t14-/m0/s1
3.10E+3 -7.51n/an/an/an/an/a6.525
Rheinische Friedrich-Wilhelms-Universitat Bonn
Assay Description
Enzyme activities were calculated from kinetic measurements performed by spectrophotometric detection of the product p-nitroaniline (pNA) at waveleng...
J Med Chem 48: 7688-707 (2005)
Article DOI: 10.1021/jm050686b
BindingDB Entry DOI: 10.7270/Q2GB22BG
Cathepsin B
(Homo sapiens (Human))
BDBM19768
(Cbz-Leu-NH-CH2-CN | JMC487688 Compound 8 | benzyl ...)
Show SMILES CC(C)C[C@H](NC(=O)OCc1ccccc1)C(=O)NCC#N |r|
Show InChI InChI=1S/C16H21N3O3/c1-12(2)10-14(15(20)18-9-8-17)19-16(21)22-11-13-6-4-3-5-7-13/h3-7,12,14H,9-11H2,1-2H3,(H,18,20)(H,19,21)/t14-/m0/s1
Reactome pathway
3.20E+4n/an/an/an/an/an/a6.0n/a
University of Bonn
Curated by ChEMBL
Assay Description
Inhibition of human liver cathepsin B using Cbz-Arg-Arg-pNA as substrate at pH 6 incubated for 30 mins measured for 20 mins by photometrical analysis
ACS Med Chem Lett 7: 211-6 (2016)
BindingDB Entry DOI: 10.7270/Q2TH8PMM
Cathepsin K
(Homo sapiens (Human))
BDBM19768
(Cbz-Leu-NH-CH2-CN | JMC487688 Compound 8 | benzyl ...)
Show SMILES CC(C)C[C@H](NC(=O)OCc1ccccc1)C(=O)NCC#N |r|
Show InChI InChI=1S/C16H21N3O3/c1-12(2)10-14(15(20)18-9-8-17)19-16(21)22-11-13-6-4-3-5-7-13/h3-7,12,14H,9-11H2,1-2H3,(H,18,20)(H,19,21)/t14-/m0/s1
Reactome pathway
n/an/a 39n/an/an/an/an/an/a
Novartis Pharmaceuticals
Assay Description
The substrate hydrolysis with or without inhibitor was monitored at an excitation wavelength of 360nm and an emission wavelength of 460 nm on a fluor...
Bioorg Med Chem Lett 16: 2549-54 (2006)
Article DOI: 10.1016/j.bmcl.2006.01.104
BindingDB Entry DOI: 10.7270/Q2XG9PFB