BDBM1980 13-amino-5-methyl-9-propyl-2-oxa-9-azatricyclo[9.4.0.0^{3,8}]pentadeca-1(15),3,5,7,11,13-hexaen-10-one::Dibenzoxazepinone 28
SMILES: CCCN1c2ccc(C)cc2Oc2ccc(N)cc2C1=O
InChI Key: InChIKey=CLJJLIVLJCOMDM-UHFFFAOYSA-N
Data: 1 IC50
Activity Spreadsheet -- Enzyme Inhibition Constant Data from BindingDB
Found 1 hit for monomerid = 1980
Trg + Lig
Ki
nM
ΔG°
kcal/mole
IC50
nM
Kd
nM
EC50/IC50
nM
koff
s-1
kon
M-1s-1
pHTemp
°C
HIV-1 Reverse Transcriptase
(Human immunodeficiency virus type 1)
BDBM1980
(13-amino-5-methyl-9-propyl-2-oxa-9-azatricyclo[9.4...)
Show SMILES CCCN1c2ccc(C)cc2Oc2ccc(N)cc2C1=O
Show InChI InChI=1S/C17H18N2O2/c1-3-8-19-14-6-4-11(2)9-16(14)21-15-7-5-12(18)10-13(15)17(19)20/h4-7,9-10H,3,8,18H2,1-2H3
n/an/a 130n/an/an/an/a7.822
Boehringer Ingelheim Pharmaceuticals Inc.
Assay Description
The IC50 of reverse transcriptase is the concentration that inhibits 50% of recombinant HIV-1 RT RNA-directed DNA polymerase activity in vitro.
J Med Chem 35: 1887-97 (1992)
Article DOI: 10.1021/jm00088a027
BindingDB Entry DOI: 10.7270/Q2ST7N0J