null
SMILES: Oc1ccc(cc1)[C@@H]1CCN(C[C@H]1F)[C@@H]1CCN(Cc2ccc(cc2)C(F)(F)F)C1=O
InChI Key: InChIKey=YALQZTSLSZMJHO-PWRODBHTSA-N
Activity Spreadsheet -- Enzyme Inhibition Constant Data from BindingDB
Found 1 hit for monomerid = 198780
Trg + Lig
Ki
nM
ΔG°
kcal/mole
IC50
nM
Kd
nM
EC50/IC50
nM
koff
s-1
kon
M-1s-1
pHTemp
°C
Glutamate receptor ionotropic, NMDA 2B
(Rattus norvegicus (Rat))
BDBM198780
(US9221796, 72)
Show SMILES Oc1ccc(cc1)[C@@H]1CCN(C[C@H]1F)[C@@H]1CCN(Cc2ccc(cc2)C(F)(F)F)C1=O |r|
Show InChI InChI=1S/C23H24F4N2O2/c24-20-14-28(11-9-19(20)16-3-7-18(30)8-4-16)21-10-12-29(22(21)31)13-15-1-5-17(6-2-15)23(25,26)27/h1-8,19-21,30H,9-14H2/t19-,20+,21+/m0/s1
US Patent
6 -12.1n/an/an/an/an/an/a50
Bristol-Myers Squibb Company
US Patent
Assay Description
To perform the competition binding assay, thawed membrane homogenate was added to each well of a 96-well plate (20 ug/well). The experimental compo...
US Patent US9221796 (2015)
BindingDB Entry DOI: 10.7270/Q20V8BK1