null
SMILES: CC(C)(NCCS(C)(=O)=O)c1ccc(NC(=O)c2nc(c[nH]2)C#N)c(c1)C1=CCC(C)(C)CC1
InChI Key: InChIKey=VTFKMZDPVCECOW-UHFFFAOYSA-N
Activity Spreadsheet -- Enzyme Inhibition Constant Data from BindingDB
Found 1 hit for monomerid = 198855
Trg + Lig
Ki
nM
ΔG°
kcal/mole
IC50
nM
Kd
nM
EC50/IC50
nM
koff
s-1
kon
M-1s-1
pHTemp
°C
Macrophage colony-stimulating factor 1 receptor [555-568]
(Homo sapiens (Human))
BDBM198855
(US9221797, 18)
Show SMILES CC(C)(NCCS(C)(=O)=O)c1ccc(NC(=O)c2nc(c[nH]2)C#N)c(c1)C1=CCC(C)(C)CC1 |t:28|
Show InChI InChI=1S/C25H33N5O3S/c1-24(2)10-8-17(9-11-24)20-14-18(25(3,4)28-12-13-34(5,32)33)6-7-21(20)30-23(31)22-27-16-19(15-26)29-22/h6-8,14,16,28H,9-13H2,1-5H3,(H,27,29)(H,30,31)
US Patent
n/an/a 1.80n/an/an/an/a7.5n/a
Janssen Pharmaceutica NV
US Patent
Assay Description
A fluorescence polarization competition immunoassay was used to measure compound inhibition of CSF-1R phosphorylation of tyrosine on a synthetic CS...
US Patent US9221797 (2015)
BindingDB Entry DOI: 10.7270/Q2W37V4H