BDBM199090 US9676792, Compound 26::XMD17-109
SMILES: COc1cc(ccc1Nc1ncc2N(C)C(=O)c3ccccc3N(C3CCCC3)c2n1)C(=O)N1CCC(CC1)N1CCN(C)CC1
InChI Key: InChIKey=OXSKLFUMHBJZNS-UHFFFAOYSA-N
Data: 2 IC50  1 EC50
PDB links: 2 PDB IDs match this monomer.
Activity Spreadsheet -- Enzyme Inhibition Constant Data from BindingDB
Found 2 hits for monomerid = 199090
Trg + Lig
Ki
nM
ΔG°
kcal/mole
IC50
nM
Kd
nM
EC50/IC50
nM
koff
s-1
kon
M-1s-1
pHTemp
°C
Mitogen-activated protein kinase 7
(Homo sapiens (Human))
BDBM199090
(US9676792, Compound 26 | XMD17-109)
Show SMILES COc1cc(ccc1Nc1ncc2N(C)C(=O)c3ccccc3N(C3CCCC3)c2n1)C(=O)N1CCC(CC1)N1CCN(C)CC1
Show InChI InChI=1S/C35H44N8O3/c1-39-18-20-41(21-19-39)25-14-16-42(17-15-25)33(44)24-12-13-28(31(22-24)46-3)37-35-36-23-30-32(38-35)43(26-8-4-5-9-26)29-11-7-6-10-27(29)34(45)40(30)2/h6-7,10-13,22-23,25-26H,4-5,8-9,14-21H2,1-3H3,(H,36,37,38)
US Patent
n/an/a 162n/a 90n/an/a7.5n/a
Dana-Farber Cancer Institute, Inc.
US Patent
Assay Description
Kinase activity was determined in an assay volume of 40 μl in kinase buffer (50 mM Tris-HCl, pH 7.5, 0.1 mM EGTA, 1 mM 2-mercaptoethanol) contai...
US Patent US9676792 (2017)
BindingDB Entry DOI: 10.7270/Q2Z31WT7
3D
3D Structure (crystal)
Leucine-rich repeat serine/threonine-protein kinase 2 [G2019S]
(Homo sapiens (Human))
BDBM199090
(US9676792, Compound 26 | XMD17-109)
Show SMILES COc1cc(ccc1Nc1ncc2N(C)C(=O)c3ccccc3N(C3CCCC3)c2n1)C(=O)N1CCC(CC1)N1CCN(C)CC1
Show InChI InChI=1S/C35H44N8O3/c1-39-18-20-41(21-19-39)25-14-16-42(17-15-25)33(44)24-12-13-28(31(22-24)46-3)37-35-36-23-30-32(38-35)43(26-8-4-5-9-26)29-11-7-6-10-27(29)34(45)40(30)2/h6-7,10-13,22-23,25-26H,4-5,8-9,14-21H2,1-3H3,(H,36,37,38)
US Patent
n/an/a 339n/an/an/an/an/an/a
Dana-Farber Cancer Institute, Inc.
US Patent
Assay Description
In vitro kinase assays were conducted at Invitrogen (Madison, Wis.) using the SelectScreen Kinase Profiling Service.
US Patent US9676792 (2017)
BindingDB Entry DOI: 10.7270/Q2Z31WT7