BDBM199127 N-(4-(1-(4,6-di(piperazin-1-yl)-1,3,5-triazin-2-yl)-5-(4-methoxyphenyl)-1H-pyrazol-3-yl)phenyl)-4-methylbenzenesulphonamide (8i)
SMILES: COc1ccc(cc1)-c1cc(nn1-c1nc(nc(n1)N1CCNCC1)N1CCNCC1)-c1ccc(NS(=O)(=O)c2ccc(C)cc2)cc1
InChI Key: InChIKey=MZYOFVXOKOUHQS-UHFFFAOYSA-N
Data: 2 IC50
Activity Spreadsheet -- Enzyme Inhibition Constant Data from BindingDB
Found 2 hits for monomerid = 199127
Trg + Lig
Ki
nM
ΔG°
kcal/mole
IC50
nM
Kd
nM
EC50/IC50
nM
koff
s-1
kon
M-1s-1
pHTemp
°C
Matrix metalloproteinase-9 (MMP-9)
(Rattus norvegicus (Rat))
BDBM199127
(N-(4-(1-(4,6-di(piperazin-1-yl)-1,3,5-triazin-2-yl...)
Show SMILES COc1ccc(cc1)-c1cc(nn1-c1nc(nc(n1)N1CCNCC1)N1CCNCC1)-c1ccc(NS(=O)(=O)c2ccc(C)cc2)cc1
Show InChI InChI=1S/C34H38N10O3S/c1-24-3-13-29(14-4-24)48-47-46-41-27-9-5-25(6-10-27)30-23-31(26-7-11-28(45-2)12-8-26)44(40-30)34-38-32(42-19-15-35-16-20-42)37-33(39-34)43-21-17-36-18-22-43/h3-14,23,35-36,41H,15-22H2,1-2H3
n/an/a 47.1n/an/an/an/a7.525
Zhejiang Hospital
Assay Description
where a pro-fluorescing peptide is used as substrate, and the fluorogenic activity of its cleavage product is measured after co-incubation with the a...
Chem Biol Drug Des 88: 756-765 (2016)
Article DOI: 10.1111/cbdd.12807
BindingDB Entry DOI: 10.7270/Q2ZW1JR4
Matrix metalloproteinase-2 (MMP-2)
(Rattus norvegicus (Rat))
BDBM199127
(N-(4-(1-(4,6-di(piperazin-1-yl)-1,3,5-triazin-2-yl...)
Show SMILES COc1ccc(cc1)-c1cc(nn1-c1nc(nc(n1)N1CCNCC1)N1CCNCC1)-c1ccc(NS(=O)(=O)c2ccc(C)cc2)cc1
Show InChI InChI=1S/C34H38N10O3S/c1-24-3-13-29(14-4-24)48-47-46-41-27-9-5-25(6-10-27)30-23-31(26-7-11-28(45-2)12-8-26)44(40-30)34-38-32(42-19-15-35-16-20-42)37-33(39-34)43-21-17-36-18-22-43/h3-14,23,35-36,41H,15-22H2,1-2H3
n/an/a 55.3n/an/an/an/a7.525
Zhejiang Hospital
Assay Description
where a pro-fluorescing peptide is used as substrate, and the fluorogenic activity of its cleavage product is measured after co-incubation with the a...
Chem Biol Drug Des 88: 756-765 (2016)
Article DOI: 10.1111/cbdd.12807
BindingDB Entry DOI: 10.7270/Q2ZW1JR4