null
SMILES: Cc1ncc(n1CCOC(=O)c1cc(-c2ccc(Cl)cc2)n(n1)-c1ccc(C)cc1)[N+]([O-])=O
InChI Key: InChIKey=SQZNAAKYVKVPSR-UHFFFAOYSA-N
Activity Spreadsheet -- Enzyme Inhibition Constant Data from BindingDB
Found 1 hit for monomerid = 199132
Trg + Lig
Ki
nM
ΔG°
kcal/mole
IC50
nM
Kd
nM
EC50/IC50
nM
koff
s-1
kon
M-1s-1
pHTemp
°C
Tyrosine--tRNA ligase
(Staphylococcus aureus (strain MSSA476))
BDBM199132
(2-(2-Methyl-5-nitro-1H-imidazol-1-yl)-ethyl-5-(4-c...)
Show SMILES Cc1ncc(n1CCOC(=O)c1cc(-c2ccc(Cl)cc2)n(n1)-c1ccc(C)cc1)[N+]([O-])=O
Show InChI InChI=1S/C23H20ClN5O4/c1-15-3-9-19(10-4-15)28-21(17-5-7-18(24)8-6-17)13-20(26-28)23(30)33-12-11-27-16(2)25-14-22(27)29(31)32/h3-10,13-14H,11-12H2,1-2H3
n/an/a 4.78E+4n/an/an/an/a7.9n/a
Nanjing University
Assay Description
The assays were conducted at 37 °C in a mixture containing 100 mM Tris/Cl pH 7.9, 50 mM KCl, 16 mM MgCl2, 5 mM ATP, 3 mM DTT, 4 mg/ml E. coli MRE600 ...
Chem Biol Drug Des 88: 592-8 (2016)
Article DOI: 10.1111/cbdd.12793
BindingDB Entry DOI: 10.7270/Q2V69HDF