null
SMILES: Cc1ncc(n1CCOC(=O)c1cc(-c2ccc(F)cc2)n(n1)-c1ccccc1)[N+]([O-])=O
InChI Key: InChIKey=ZGOIUTCKNFPBFP-UHFFFAOYSA-N
Activity Spreadsheet -- Enzyme Inhibition Constant Data from BindingDB
Found 1 hit for monomerid = 199136
Trg + Lig
Ki
nM
ΔG°
kcal/mole
IC50
nM
Kd
nM
EC50/IC50
nM
koff
s-1
kon
M-1s-1
pHTemp
°C
Tyrosine--tRNA ligase
(Staphylococcus aureus (strain MSSA476))
BDBM199136
(2-(2-Methyl-5-nitro-1H-imidazol-1-yl)-ethyl-5-(4-f...)
Show SMILES Cc1ncc(n1CCOC(=O)c1cc(-c2ccc(F)cc2)n(n1)-c1ccccc1)[N+]([O-])=O
Show InChI InChI=1S/C22H18FN5O4/c1-15-24-14-21(28(30)31)26(15)11-12-32-22(29)19-13-20(16-7-9-17(23)10-8-16)27(25-19)18-5-3-2-4-6-18/h2-10,13-14H,11-12H2,1H3
n/an/a 7.00E+4n/an/an/an/a7.9n/a
Nanjing University
Assay Description
The assays were conducted at 37 °C in a mixture containing 100 mM Tris/Cl pH 7.9, 50 mM KCl, 16 mM MgCl2, 5 mM ATP, 3 mM DTT, 4 mg/ml E. coli MRE600 ...
Chem Biol Drug Des 88: 592-8 (2016)
Article DOI: 10.1111/cbdd.12793
BindingDB Entry DOI: 10.7270/Q2V69HDF