BDBM199150 2-(2-Methyl-5-nitro-1H-imidazol-1-yl)-ethyl-1-phenyl-5-(m-tolyl)-1H-pyrazole-3-carboxylate (4v)
SMILES: Cc1ncc(n1CCOC(=O)c1cc(-c2cccc(C)c2)n(n1)-c1ccccc1)[N+]([O-])=O
InChI Key: InChIKey=MWWWYRFBVZUUHR-UHFFFAOYSA-N
Data: 1 IC50
Activity Spreadsheet -- Enzyme Inhibition Constant Data from BindingDB
Found 1 hit for monomerid = 199150
Trg + Lig
Ki
nM
ΔG°
kcal/mole
IC50
nM
Kd
nM
EC50/IC50
nM
koff
s-1
kon
M-1s-1
pHTemp
°C
Tyrosyl-tRNA synthetase (TryRS)
(Staphylococcus aureus (Firmicutes))
BDBM199150
(2-(2-Methyl-5-nitro-1H-imidazol-1-yl)-ethyl-1-phen...)
Show SMILES Cc1ncc(n1CCOC(=O)c1cc(-c2cccc(C)c2)n(n1)-c1ccccc1)[N+]([O-])=O
Show InChI InChI=1S/C23H21N5O4/c1-16-7-6-8-18(13-16)21-14-20(25-27(21)19-9-4-3-5-10-19)23(29)32-12-11-26-17(2)24-15-22(26)28(30)31/h3-10,13-15H,11-12H2,1-2H3
n/an/a 2.16E+4n/an/an/an/a7.9n/a
Nanjing University
Assay Description
The assays were conducted at 37 °C in a mixture containing 100 mM Tris/Cl pH 7.9, 50 mM KCl, 16 mM MgCl2, 5 mM ATP, 3 mM DTT, 4 mg/ml E. coli MRE600 ...
Chem Biol Drug Des 88: 592-8 (2016)
Article DOI: 10.1111/cbdd.12793
BindingDB Entry DOI: 10.7270/Q2V69HDF