BDBM199205 US9216998, 9
SMILES: FC(F)(F)c1c(CCc2ccccc2)n2CCCCc3cccc1c23
InChI Key: InChIKey=UCJXYPHNWBXQJX-UHFFFAOYSA-N
Data: 2 IC50
Activity Spreadsheet -- Enzyme Inhibition Constant Data from BindingDB
Found 2 hits for monomerid = 199205
Trg + Lig
Ki
nM
ΔG°
kcal/mole
IC50
nM
Kd
nM
EC50/IC50
nM
koff
s-1
kon
M-1s-1
pHTemp
°C
Endothelial lipase (EL)
(Mus musculus (Mouse))
BDBM199205
(US9216998, 9)
Show SMILES FC(F)(F)c1c(CCc2ccccc2)n2CCCCc3cccc1c23
Show InChI InChI=1S/C21H20F3N/c22-21(23,24)19-17-11-6-10-16-9-4-5-14-25(20(16)17)18(19)13-12-15-7-2-1-3-8-15/h1-3,6-8,10-11H,4-5,9,12-14H2
US Patent
n/an/a 36n/an/an/an/a7.2n/a
Janssen Pharmaceutica NV
US Patent
Assay Description
To assay for cell surface lipase activity, cells expressing human endothelial lipase (EL) or LPL were plated in CellBIND® 384-well plates (Corning, L...
US Patent US9216998 (2015)
BindingDB Entry DOI: 10.7270/Q22N513F
Endothelial lipase
(Homo sapiens (Human))
BDBM199205
(US9216998, 9)
Show SMILES FC(F)(F)c1c(CCc2ccccc2)n2CCCCc3cccc1c23
Show InChI InChI=1S/C21H20F3N/c22-21(23,24)19-17-11-6-10-16-9-4-5-14-25(20(16)17)18(19)13-12-15-7-2-1-3-8-15/h1-3,6-8,10-11H,4-5,9,12-14H2
US Patent
n/an/a 43n/an/an/an/a7.2n/a
Janssen Pharmaceutica NV
US Patent
Assay Description
To assay for cell surface lipase activity, cells expressing human endothelial lipase (EL) or LPL were plated in CellBIND® 384-well plates (Corning, L...
US Patent US9216998 (2015)
BindingDB Entry DOI: 10.7270/Q22N513F