BDBM199208 US9216998, 12
SMILES: CC(C)NC(=O)N1CCn2c(CCc3ccccc3)c(c3cccc(C1)c23)C(F)(F)F
InChI Key: InChIKey=CLSJZJZZLIGEBQ-UHFFFAOYSA-N
Data: 2 IC50
Activity Spreadsheet -- Enzyme Inhibition Constant Data from BindingDB
Found 2 hits for monomerid = 199208
Trg + Lig
Ki
nM
ΔG°
kcal/mole
IC50
nM
Kd
nM
EC50/IC50
nM
koff
s-1
kon
M-1s-1
pHTemp
°C
Endothelial lipase (EL)
(Mus musculus (Mouse))
BDBM199208
(US9216998, 12)
Show SMILES CC(C)NC(=O)N1CCn2c(CCc3ccccc3)c(c3cccc(C1)c23)C(F)(F)F
Show InChI InChI=1S/C24H26F3N3O/c1-16(2)28-23(31)29-13-14-30-20(12-11-17-7-4-3-5-8-17)21(24(25,26)27)19-10-6-9-18(15-29)22(19)30/h3-10,16H,11-15H2,1-2H3,(H,28,31)
US Patent
n/an/a 131n/an/an/an/a7.2n/a
Janssen Pharmaceutica NV
US Patent
Assay Description
To assay for cell surface lipase activity, cells expressing human endothelial lipase (EL) or LPL were plated in CellBIND® 384-well plates (Corning, L...
US Patent US9216998 (2015)
BindingDB Entry DOI: 10.7270/Q22N513F
Endothelial lipase
(Homo sapiens (Human))
BDBM199208
(US9216998, 12)
Show SMILES CC(C)NC(=O)N1CCn2c(CCc3ccccc3)c(c3cccc(C1)c23)C(F)(F)F
Show InChI InChI=1S/C24H26F3N3O/c1-16(2)28-23(31)29-13-14-30-20(12-11-17-7-4-3-5-8-17)21(24(25,26)27)19-10-6-9-18(15-29)22(19)30/h3-10,16H,11-15H2,1-2H3,(H,28,31)
US Patent
n/an/a 135n/an/an/an/a7.2n/a
Janssen Pharmaceutica NV
US Patent
Assay Description
To assay for cell surface lipase activity, cells expressing human endothelial lipase (EL) or LPL were plated in CellBIND® 384-well plates (Corning, L...
US Patent US9216998 (2015)
BindingDB Entry DOI: 10.7270/Q22N513F