BDBM199220 US9216998, 1
SMILES: FC(F)(F)c1c(CCCc2ccccc2)n2CCc3cccc1c23
InChI Key: InChIKey=ZATUNKOSOLFDCW-UHFFFAOYSA-N
Data: 2 IC50
Activity Spreadsheet -- Enzyme Inhibition Constant Data from BindingDB
Found 2 hits for monomerid = 199220
Trg + Lig
Ki
nM
ΔG°
kcal/mole
IC50
nM
Kd
nM
EC50/IC50
nM
koff
s-1
kon
M-1s-1
pHTemp
°C
Endothelial lipase (EL)
(Mus musculus (Mouse))
BDBM199220
(US9216998, 1)
Show SMILES FC(F)(F)c1c(CCCc2ccccc2)n2CCc3cccc1c23
Show InChI InChI=1S/C20H18F3N/c21-20(22,23)18-16-10-5-9-15-12-13-24(19(15)16)17(18)11-4-8-14-6-2-1-3-7-14/h1-3,5-7,9-10H,4,8,11-13H2
US Patent
n/an/a 195n/an/an/an/a7.2n/a
Janssen Pharmaceutica NV
US Patent
Assay Description
To assay for cell surface lipase activity, cells expressing human endothelial lipase (EL) or LPL were plated in CellBIND® 384-well plates (Corning, L...
US Patent US9216998 (2015)
BindingDB Entry DOI: 10.7270/Q22N513F
Endothelial lipase
(Homo sapiens (Human))
BDBM199220
(US9216998, 1)
Show SMILES FC(F)(F)c1c(CCCc2ccccc2)n2CCc3cccc1c23
Show InChI InChI=1S/C20H18F3N/c21-20(22,23)18-16-10-5-9-15-12-13-24(19(15)16)17(18)11-4-8-14-6-2-1-3-7-14/h1-3,5-7,9-10H,4,8,11-13H2
US Patent
n/an/a 185n/an/an/an/a7.2n/a
Janssen Pharmaceutica NV
US Patent
Assay Description
To assay for cell surface lipase activity, cells expressing human endothelial lipase (EL) or LPL were plated in CellBIND® 384-well plates (Corning, L...
US Patent US9216998 (2015)
BindingDB Entry DOI: 10.7270/Q22N513F